{"text_format":"1","workbook":"xlsx","n_sheets":5,"sheets":["Employee Details","Calculation Sheet","Extras","Leaver Form","Options"],"not_rendered":{"charts":0,"images":1,"macros":1,"external_links":0,"defined_names":5,"comments":2,"pivot_tables":0},"unopened":[],"bounds":{"document_bytes":16777216,"sheet_cells":100000,"rows_first":2000,"rows_last":500,"rows_between":2000,"halvings":0,"cell_chars":16384,"cell_head_chars":4096},"cells_cut":0,"cells_raw":0,"read":"whole","date_system":"1900"}

{"sheet":"Employee Details","index":0,"n_rows":31,"n_cols":6,"rows_kept":31,"cut":false,"hidden":false,"merged":[[23,0,24,1],[0,1,4,1],[15,2,15,4],[16,2,18,4],[19,2,19,7],[16,5,18,9]]}
[null,"Employee Details"]
[]
[]
[]
[]
["Which LGPS fund is membership of ?"]
["Surname"]
["Forename(s)"]
["Employees Personal Email Address (if known)"]
["Date of Birth"]
["National Insurance No"]
["Pay reference"]
["Does the employee have more than one pensionable employment"]
[{"$f":"IF(B13=\"Yes\",\"Please confirm hours/term-time weeks of post to be terminated\",\"\")","v":""}]
["Did the pensionable employment start on or after 01/04/2014 (CARE scheme only)"]
[{"$f":"IF(B15=\"Yes\",\"Please confirm FTE* pay of post to be terminated - CARE scheme only\",\"\")","v":""},null,{"$f":"IF(A16=\"Please confirm FTE* pay of post to be terminated - CARE scheme only\",\" *Full time equivalent rate of pay\",\"\")","v":""}]
["Date of Termination",null,{"$f":"IF(OR(B18=\"Redundancy (over 55 - with pension)\",B18=\"Flexible Retirement (reductions waived)\",B18=\"Efficiency of Service (over 55 - with pension)\"),\"WARNING PENSION STRAIN COST MAY APPLY\",\" \")","v":" "},null,null,{"$f":"IF(B18=\"Dismissal\",\"If dismissal due to fraudulent character or grave misconduct, pension benefits can be withheld. Please confirm in comments section, if you wish to exercise this right.\",\" \")","v":" "}]
["Reason For Termination"]
[{"$f":"IF(B18=\"Flexible Retirement (reductions waived)\",\"Flexible Retirements Only - Please confirm the member has had a reduction in pay (grade) or hours\",IF(B18=\"Flexible Retirement (reductions applied)\",\"Flexible Retirements Only - Please confirm the member has had a reduction in pay (grade) or hours\",\"\"))","v":""}]
[{"$f":"IF(B18=\"TUPE transfer (state new employer, if known below)\",\"New Employer (TUPE leavers only, if known)\",\"\")","v":""}]
[{"$f":"IF(B15=\"yes\",\"\",\"Is final pay period a previous corresponding year?\")","v":"Is final pay period a previous corresponding year?"}]
[{"$f":"IF(B21=\"Yes\",\"Please confirm date of previous corresponding year\",\"\")","v":""}]
[]
[{"$f":"VLOOKUP(B28,A29:B31,2,0)","v":"Not all mandatory fields completed"}]
[]
[{"$f":"IF(COUNTA(B6,B7,B8,B10,B11,B12,B13,B15,B16,B17,B18)=11,\"completed\",\"not all completed\")","v":"not all completed"},{"$f":"IF(A26=\"not all completed\",0,1)","v":0}]
[{"$f":"IF(COUNTA(B6,B7,B8,B10,B11,B12,B13,B15,B17,B18,B21)=11,\"completed\",\"not all completed\")","v":"not all completed"},{"$f":"IF(A27=\"not all completed\",0,2)","v":0}]
[null,{"$f":"MAX(B26:B27)","v":0}]
[0,"Not all mandatory fields completed"]
[1,"All mandatory fields completed, move on to Calculation Sheet"]
[2,"All mandatory fields completed, move on to Calculation Sheet"]

{"sheet":"Calculation Sheet","index":1,"n_rows":383,"n_cols":20,"rows_kept":383,"cut":false,"hidden":false,"merged":[[3,0,3,1],[20,12,20,14],[5,15,5,17],[38,16,38,17],[23,12,23,14],[31,13,31,17],[32,13,32,17],[30,13,30,17],[29,13,29,17],[9,19,9,24],[15,19,15,24],[16,19,16,24],[12,19,12,24],[13,19,13,24],[14,19,14,24],[10,19,10,24],[11,19,11,24],[59,0,59,1],[27,12,27,15],[24,12,26,14],[24,15,26,15],[21,0,28,10],[21,12,21,14],[22,13,22,15],[0,0,1,9],[0,10,1,14],[19,0,19,10],[20,0,20,10],[47,14,47,15],[4,0,4,1],[3,7,3,12],[3,13,3,14],[3,3,3,4],[2,13,2,14],[2,2,2,9],[3,5,3,6],[2,10,2,12],[5,0,5,1],[6,0,6,1],[2,0,2,1]]}
[{"$f":"CONCATENATE(\"Name\",\":\",\" \",'Employee Details'!B7, \",\", \" \",'Employee Details'!B8,\" \", \" \", \"NINO\",\":\",\" \",'Employee Details'!B11,\" \",\" \",\"Pay ref\",\":\", \" \",,'Employee Details'!B12)","v":"Name: ,   NINO:   Pay ref: "},null,null,null,null,null,null,null,null,null,{"$f":"IF('Employee Details'!B6=0,\"\",'Employee Details'!B6)","v":""}]
[]
[{"$f":"'Employee Details'!A18","v":"Reason For Termination"},null,{"$f":"IF('Employee Details'!B18=0,\"\",'Employee Details'!B18)","v":""},null,null,null,null,null,null,null,{"$f":"'Employee Details'!A17","v":"Date of Termination"},null,null,{"$f":"IF('Employee Details'!B17=0,\"\",'Employee Details'!B17)","v":""}]
[{"$f":"'Employee Details'!A21","v":"Is final pay period a previous corresponding year?"},null,{"$f":"IF('Employee Details'!B21=0,\"\",'Employee Details'!B21)","v":""},{"$f":"'Employee Details'!A22","v":""},null,{"$f":"IF('Employee Details'!B22=0,\"\",'Employee Details'!B22)","v":""},null,"FTE (Final Salary/Scale Point/Gradestep) of Post to be Terminated",null,null,null,null,null,{"$f":"IF('Employee Details'!B16<>\"\",'Employee Details'!B16,(IF(K1=\"Lancashire County Pension Fund\",'Calculation Sheet'!B10*12*('Calculation Sheet'!N10/'Calculation Sheet'!M10)*('Calculation Sheet'!P10/'Calculation Sheet'!O10),IF(K1=\"Cumbria County LGPS\",'Calculation Sheet'!B10*12*('Calculation Sheet'!N10/'Calculation Sheet'!M10)))))","v":false}]
["Pensionable Pay due/paid after date of leaving (if applicable)(CARE scheme)"]
["Month"]
["Amount(£)"]
[]
[null,"MONTHLY BASIC PAY (salary)","START DATE","END DATE","Days Worked in Start Month","Days Worked in End Month","Complete Calendar Months Worked","Days","Months","Years",null,"Pay in Period","Contractual Weekly Hours","FTE Hours (i.e. 36.25/37.00 etc.)","Contractual Weeks (term-time weeks if applicable) ","FTE weeks (52 OR 52.143 etc.)","FTE PAY","P/T HRS (INCLUDING SCALED DOWN IF TERM-TIME) ","Calc column"]
["(Latest date at top)",null,null,null,null,null,null,null,null,null,null,null,null,null,null,null,null,{"$f":"IF(M10=0,\"\",M10/P10*O10)","v":""},null,{"$f":"IF(AND(B10<>\"\",OR(C10=\"\",D10=\"\",M10=\"\",N10=\"\",O10=\"\",P10=\"\")),\"WARNING CHECK ALL COLUMNS COMPLETED\",\"\")","v":""}]
["(dd/mm/yy)",null,null,null,null,null,null,null,null,null,null,null,null,null,null,null,null,{"$f":"IF(M11=0,\"\",M11/P11*O11)","v":""},{"$f":"IF(B11=0,\"\",+C10-D11-1)","v":""},{"$f":"IF(AND(B11<>\"\",OR(C11=\"\",D11=\"\",M11=\"\",N11=\"\",O11=\"\",P11=\"\")),\"WARNING CHECK ALL COLUMNS COMPLETED\",\"\")","v":""}]
[null,null,null,null,null,null,null,null,null,null,null,null,null,null,null,null,null,{"$f":"IF(M12=0,\"\",M12/P12*O12)","v":""},{"$f":"IF(B12=0,\"\",+C11-D12-1)","v":""},{"$f":"IF(AND(B12<>\"\",OR(C12=\"\",D12=\"\",M12=\"\",N12=\"\",O12=\"\",P12=\"\")),\"WARNING CHECK ALL COLUMNS COMPLETED\",\"\")","v":""}]
[null,null,null,null,null,null,null,null,null,null,null,null,null,null,null,null,null,{"$f":"IF(M13=0,\"\",M13/P13*O13)","v":""},"",{"$f":"IF(AND(B13<>\"\",OR(C13=\"\",D13=\"\",M13=\"\",N13=\"\",O13=\"\",P13=\"\")),\"WARNING CHECK ALL COLUMNS COMPLETED\",\"\")","v":""}]
[null,null,null,null,null,null,null,null,null,null,null,null,null,null,null,null,null,"","",""]
[null,null,null,null,null,null,null,null,null,null,null,null,null,null,null,null,null,"","",""]
[null,null,null,null,null,null,null,null,null,null,null,null,null,null,null,null,null,"","",""]
[null,null,null,null,null,null,null,null,null,null,null,null,null,null,null,null,null,"","",""]
[null,null,null,null,31,null,null,null,null,null,31,null,null,null,null,null,{"$f":"SUM(Q10:Q17)","v":0},null,{"$f":"SUM(S10:S17)","v":0}]
[]
["Additional Comments (any comments to assist LPPA in processing the pension benefits)"]
["Examples:- Assumed Pensionable Pay (APP) amounts, APP dates, Leave Without Pay dates, maternity dates",null,null,null,null,null,null,null,null,null,null,null,"SCALED UP EXTRAS",null,null,{"$f":"Extras!A19","v":0}]
[null,null,null,null,null,null,null,null,null,null,null,null,"NON SCALED UP EXTRAS",null,null,{"$f":"Extras!A33","v":0}]
[null,null,null,null,null,null,null,null,null,null,null,null,null,"EXTRAS SUBTOTAL",null,null,{"$f":"SUM(P21:P23)","v":0}]
[null,null,null,null,null,null,null,null,null,null,null,null,"AD-HOC EXTRAS",null,null,{"$f":"Extras!A42","v":0}]
[null,null,null,null,null,null,null,null,null,null,null,null,"SCALED UP FACTOR (IF FINAL PAY PERIOD <365 DAYS)"]
[]
[]
[null,null,null,null,null,null,null,null,null,null,null,null,"TOTAL FINAL PAY for calculating pension benefits (pre April 2014 benefits only)",null,null,null,{"$f":"SUM((Q18+Q23)*P25)+P24","v":0}]
[]
[null,null,null,null,null,null,null,null,null,null,null,null,"Completed By"]
[null,null,null,null,null,null,null,null,null,null,null,null,"Email Address"]
[null,null,null,null,null,null,null,null,null,null,null,null,"Contact no."]
[null,null,null,null,null,null,null,null,null,null,null,null,"Date"]
[]
[]
[]
[]
[]
[]
[]
{"$rows_left_out":344}
{"sheet":"Extras","index":2,"n_rows":60,"n_cols":14,"rows_kept":60,"cut":false,"hidden":false,"merged":[[44,12,44,13],[6,0,7,0],[0,9,1,13],[0,0,1,8],[2,12,2,13],[2,9,2,11],[2,1,2,8]]}
[{"$f":"CONCATENATE(\"Name\",\":\",\" \",'Employee Details'!B7, \",\", \" \",'Employee Details'!B8,\" \", \" \", \"NINO\",\":\",\" \",'Employee Details'!B11,\" \",\" \",\"Pay ref\",\":\", \" \",,'Employee Details'!B12)","v":"Name: ,   NINO:   Pay ref: "},null,null,null,null,null,null,null,null,{"$f":"'Employee Details'!$B$6","v":0}]
[]
[{"$f":"'Employee Details'!A18","v":"Reason For Termination"},{"$f":"IF('Employee Details'!B18=0,\"\",'Employee Details'!B18)","v":""},null,null,null,null,null,null,null,{"$f":"'Employee Details'!A17","v":"Date of Termination"},null,null,{"$f":"IF('Employee Details'!B17=0,\"\",'Employee Details'!B17)","v":""}]
[]
[null,"END YEAR",null,null,null,null,null,null,null,null,null,null,"START YEAR"]
["SCALED UP EXTRAS",{"$f":"IF('Employee Details'!B17=\"\",\"\",YEAR('Employee Details'!B17))","v":""},null,null,null,null,null,null,null,null,null,null,{"$f":"IF(Options!A67=\"\",\"\",YEAR(Options!A67))","v":""}]
["Item\\Month",{"$f":"_xlfn.IFNA(VLOOKUP('Calculation Sheet'!A53,Options!$A54:$B65,2,FALSE),INDEX(Options!$B$54:$B$65,MATCH('Calculation Sheet'!A53,Options!$C$54:$C$65,0)))","v":"Dec"},{"$f":"_xlfn.IFNA(VLOOKUP('Calculation Sheet'!B53,Options!$A54:$B65,2,FALSE),INDEX(Options!$B$54:$B$65,MATCH('Calculation Sheet'!B53,Options!$C$54:$C$65,0)))","v":"Dec"},{"$f":"_xlfn.IFNA(VLOOKUP('Calculation Sheet'!C53,Options!$A54:$B65,2,FALSE),INDEX(Options!$B$54:$B$65,MATCH('Calculation Sheet'!C53,Options!$C$54:$C$65,0)))","v":"Dec"},{"$f":"_xlfn.IFNA(VLOOKUP('Calculation Sheet'!D53,Options!$A54:$B65,2,FALSE),INDEX(Options!$B$54:$B$65,MATCH('Calculation Sheet'!D53,Options!$C$54:$C$65,0)))","v":"Dec"},{"$f":"_xlfn.IFNA(VLOOKUP('Calculation Sheet'!E53,Options!$A54:$B65,2,FALSE),INDEX(Options!$B$54:$B$65,MATCH('Calculation Sheet'!E53,Options!$C$54:$C$65,0)))","v":"Dec"},{"$f":"_xlfn.IFNA(VLOOKUP('Calculation Sheet'!F53,Options!$A54:$B65,2,FALSE),INDEX(Options!$B$54:$B$65,MATCH('Calculation Sheet'!F53,Options!$C$54:$C$65,0)))","v":"Dec"},{"$f":"_xlfn.IFNA(VLOOKUP('Calculation Sheet'!G53,Options!$A54:$B65,2,FALSE),INDEX(Options!$B$54:$B$65,MATCH('Calculation Sheet'!G53,Options!$C$54:$C$65,0)))","v":"Dec"},{"$f":"_xlfn.IFNA(VLOOKUP('Calculation Sheet'!H53,Options!$A54:$B65,2,FALSE),INDEX(Options!$B$54:$B$65,MATCH('Calculation Sheet'!H53,Options!$C$54:$C$65,0)))","v":"Dec"},{"$f":"_xlfn.IFNA(VLOOKUP('Calculation Sheet'!I53,Options!$A54:$B65,2,FALSE),INDEX(Options!$B$54:$B$65,MATCH('Calculation Sheet'!I53,Options!$C$54:$C$65,0)))","v":"Dec"},{"$f":"_xlfn.IFNA(VLOOKUP('Calculation Sheet'!J53,Options!$A54:$B65,2,FALSE),INDEX(Options!$B$54:$B$65,MATCH('Calculation Sheet'!J53,Options!$C$54:$C$65,0)))","v":"Dec"},{"$f":"_xlfn.IFNA(VLOOKUP('Calculation Sheet'!K53,Options!$A54:$B65,2,FALSE),INDEX(Options!$B$54:$B$65,MATCH('Calculation Sheet'!K53,Options!$C$54:$C$65,0)))","v":"Dec"},{"$f":"_xlfn.IFNA(VLOOKUP('Calculation Sheet'!L53,Options!$A54:$B65,2,FALSE),INDEX(Options!$B$54:$B$65,MATCH('Calculation Sheet'!L53,Options!$C$54:$C$65,0)))","v":"Dec"},{"$f":"_xlfn.IFNA(VLOOKUP('Calculation Sheet'!M53,Options!$A54:$B65,2,FALSE),INDEX(Options!$B$54:$B$65,MATCH('Calculation Sheet'!M53,Options!$C$54:$C$65,0)))","v":"Dec"}]
[null,{"$f":"+'Calculation Sheet'!A$54","v":0},{"$f":"+'Calculation Sheet'!B$54","v":0},{"$f":"+'Calculation Sheet'!C$54","v":0},{"$f":"+'Calculation Sheet'!D$54","v":0},{"$f":"+'Calculation Sheet'!E$54","v":0},{"$f":"+'Calculation Sheet'!F$54","v":0},{"$f":"+'Calculation Sheet'!G$54","v":0},{"$f":"+'Calculation Sheet'!H$54","v":0},{"$f":"+'Calculation Sheet'!I$54","v":0},{"$f":"+'Calculation Sheet'!J$54","v":0},{"$f":"+'Calculation Sheet'!K$54","v":0},{"$f":"+'Calculation Sheet'!L$54","v":0},{"$f":"+'Calculation Sheet'!M$54","v":0}]
[]
[]
[]
[]
[]
[]
[]
[]
[]
[]
[{"$f":"SUM(B19:N19)","v":0},{"$f":"IF(SUM(B9:B18)=0,0,SUM(B9:B18)/B8)","v":0},{"$f":"IF(SUM(C9:C18)=0,0,SUM(C9:C18)/C8)","v":0},{"$f":"IF(SUM(D9:D18)=0,0,SUM(D9:D18)/D8)","v":0},0,0,0,0,0,0,0,0,0,{"$f":"IF(SUM(N9:N18)=0,0,SUM(N9:N18)/N8/A57*A58)","v":0}]
[]
["NON-SCALED UP EXTRAS"]
["Item\\Month",{"$f":"IF(B7=0,\"\",B7)","v":"Dec"},"Dec","Dec","Dec","Dec","Dec","Dec","Dec","Dec","Dec","Dec","Dec","Dec"]
[]
[]
[]
[]
[]
[]
[]
[]
[]
[]
[{"$f":"SUM(B33:N33)","v":0},{"$f":"IF(SUM(B23:B32)=0,0,SUM(B23:B32))","v":0},{"$f":"SUM(C23:C32)","v":0},{"$f":"SUM(D23:D32)","v":0},0,0,0,0,0,0,0,0,0,{"$f":"IF(SUM(N23:N32)=0,0,SUM(N23:N32)*A58/A57)","v":0}]
[]
["AD-HOC EXTRAS"]
["Item\\Month",{"$f":"IF(B7=0,\"\",B7)","v":"Dec"},"Dec","Dec","Dec","Dec","Dec","Dec","Dec","Dec","Dec","Dec","Dec",{"$f":"IF(N7=0,\"\",N7)","v":"Dec"}]
[]
[]
[]
[]
{"$rows_left_out":21}
{"sheet":"Leaver Form","index":3,"n_rows":34,"n_cols":5,"rows_kept":34,"cut":false,"hidden":false,"merged":[[0,0,3,1],[27,4,30,6],[32,0,32,1],[33,0,33,1],[26,0,26,1]]}
["     Leaver Form"]
[]
[]
[]
[{"$f":"'Employee Details'!A6","v":"Which LGPS fund is membership of ?"},{"$f":"IF('Employee Details'!B6=\"\",\"\",'Employee Details'!B6)","v":""}]
[{"$f":"'Employee Details'!A7","v":"Surname"},{"$f":"IF('Employee Details'!B7=\"\",\"\",'Employee Details'!B7)","v":""}]
[{"$f":"'Employee Details'!A8","v":"Forename(s)"},{"$f":"IF('Employee Details'!B8=\"\",\"\",'Employee Details'!B8)","v":""}]
[{"$f":"'Employee Details'!A9","v":"Employees Personal Email Address (if known)"},{"$f":"IF('Employee Details'!B9=\"\",\"\",'Employee Details'!B9)","v":""}]
[{"$f":"'Employee Details'!A10","v":"Date of Birth"},{"$f":"IF('Employee Details'!B10=\"\",\"\",'Employee Details'!B10)","v":""}]
[{"$f":"'Employee Details'!A11","v":"National Insurance No"},{"$f":"IF('Employee Details'!B11=\"\",\"\",'Employee Details'!B11)","v":""}]
[{"$f":"'Employee Details'!A12","v":"Pay reference"},{"$f":"IF('Employee Details'!B12=\"\",\"\",'Employee Details'!B12)","v":""}]
[{"$f":"'Employee Details'!A13","v":"Does the employee have more than one pensionable employment"},{"$f":"IF('Employee Details'!B13=\"\",\"\",'Employee Details'!B13)","v":""}]
[{"$f":"'Employee Details'!A14","v":""},{"$f":"IF('Employee Details'!B14=\"\",\"\",'Employee Details'!B14)","v":""}]
[{"$f":"'Employee Details'!A17","v":"Date of Termination"},{"$f":"IF('Employee Details'!B17=\"\",\"\",'Employee Details'!B17)","v":""}]
[{"$f":"'Employee Details'!A18","v":"Reason For Termination"},{"$f":"IF('Employee Details'!B18=\"\",\"\",'Employee Details'!B18)","v":""}]
[{"$f":"'Employee Details'!A19","v":""},{"$f":"IF('Employee Details'!B19=\"\",\"\",'Employee Details'!B19)","v":""}]
[{"$f":"'Employee Details'!A20","v":""},{"$f":"IF('Employee Details'!B20=\"\",\"\",'Employee Details'!B20)","v":""}]
[]
[{"$f":"'Employee Details'!A15","v":"Did the pensionable employment start on or after 01/04/2014 (CARE scheme only)"},{"$f":"IF('Employee Details'!B15=\"\",\"\",'Employee Details'!B15)","v":""}]
[{"$f":"'Calculation Sheet'!H4","v":"FTE (Final Salary/Scale Point/Gradestep) of Post to be Terminated"},{"$f":"IF('Calculation Sheet'!N4=0,\"\",'Calculation Sheet'!N4)","v":false}]
[{"$f":"'Employee Details'!A21","v":"Is final pay period a previous corresponding year?"},{"$f":"IF('Employee Details'!B21=\"\",\"\",'Employee Details'!B21)","v":""}]
[{"$f":"'Employee Details'!A22","v":""},{"$f":"IF('Employee Details'!B22=\"\",\"\",'Employee Details'!B22)","v":""}]
[{"$f":"'Calculation Sheet'!M28","v":"TOTAL FINAL PAY for calculating pension benefits (pre April 2014 benefits only)"},{"$f":"IF('Calculation Sheet'!Q28=0,\"\",'Calculation Sheet'!Q28)","v":""}]
[{"$f":"'Calculation Sheet'!A5","v":"Pensionable Pay due/paid after date of leaving (if applicable)(CARE scheme)"},{"$f":"IF('Calculation Sheet'!C5=\"\",\"\",'Calculation Sheet'!C5)","v":""}]
[{"$f":"'Calculation Sheet'!A7","v":"Amount(£)"},{"$f":"IF('Calculation Sheet'!C7=\"\",\"\",'Calculation Sheet'!C7)","v":""}]
[{"$f":"'Calculation Sheet'!A20","v":"Additional Comments (any comments to assist LPPA in processing the pension benefits)"},{"$f":"IF('Calculation Sheet'!A22=\"\",\"\",'Calculation Sheet'!A22)","v":""}]
["I understand that the accuracy of this data is essential in order to calculate the member’s pension benefits and I confirm and represent that the above data is accurate and complete."]
["Authorised By",null,null,null,{"$f":"IF(OR(ISBLANK(B28),ISBLANK(B29),ISBLANK(B30),ISBLANK(B31)), \"All authorisation details must be completed or the form will not be accepted\", \"\")","v":"All authorisation details must be completed or the form will not be accepted"}]
["Email Address"]
["Contact no."]
["Date"]
[]
["Completed forms may be emailed to :-"]
["YPS.Forms@localpensionspartnership.org.uk"]

{"sheet":"Options","index":4,"n_rows":4846,"n_cols":16,"rows_kept":4846,"cut":false,"hidden":true,"merged":[]}
["Mr",null,null,null,null,null,null,"Date","Tax Year","Column1","Column2",null,"Date","Tax Year","Column1","Column2"]
["Mrs",null,null,null,null,null,null,"2008-01-01","07/08","06/07","05/06",null,"2008-01-01","07/08","06/07","05/06"]
["Miss",null,null,null,null,null,null,"2008-01-02","07/08","06/07","05/06",null,"2008-01-02","07/08","06/07","05/06"]
["Ms",null,null,null,null,null,null,"2008-01-03","07/08","06/07","05/06",null,"2008-01-03","07/08","06/07","05/06"]
["Dr",null,null,null,null,null,null,"2008-01-04","07/08","06/07","05/06",null,"2008-01-04","07/08","06/07","05/06"]
["Other",null,null,null,null,null,null,"2008-01-05","07/08","06/07","05/06",null,"2008-01-05","07/08","06/07","05/06"]
[null,null,null,null,null,null,null,"2008-01-06","07/08","06/07","05/06",null,"2008-01-06","07/08","06/07","05/06"]
[null,null,null,null,null,null,null,"2008-01-07","07/08","06/07","05/06",null,"2008-01-07","07/08","06/07","05/06"]
["Single",null,null,null,null,null,null,"2008-01-08","07/08","06/07","05/06",null,"2008-01-08","07/08","06/07","05/06"]
["Married",null,null,null,null,null,null,"2008-01-09","07/08","06/07","05/06",null,"2008-01-09","07/08","06/07","05/06"]
["Civil Partner",null,null,null,null,null,null,"2008-01-10","07/08","06/07","05/06",null,"2008-01-10","07/08","06/07","05/06"]
["Divorced",null,null,null,null,null,null,"2008-01-11","07/08","06/07","05/06",null,"2008-01-11","07/08","06/07","05/06"]
["Separated",null,null,null,null,null,null,"2008-01-12","07/08","06/07","05/06",null,"2008-01-12","07/08","06/07","05/06"]
["Nominated Co-Habiting Partner",null,null,null,null,null,null,"2008-01-13","07/08","06/07","05/06",null,"2008-01-13","07/08","06/07","05/06"]
[null,null,null,null,null,null,null,"2008-01-14","07/08","06/07","05/06",null,"2008-01-14","07/08","06/07","05/06"]
["Yes",null,null,null,null,null,null,"2008-01-15","07/08","06/07","05/06",null,"2008-01-15","07/08","06/07","05/06"]
["No",null,null,null,null,null,null,"2008-01-16","07/08","06/07","05/06",null,"2008-01-16","07/08","06/07","05/06"]
[null,null,null,null,null,null,null,"2008-01-17","07/08","06/07","05/06",null,"2008-01-17","07/08","06/07","05/06"]
["Resignation",null,null,null,null,null,null,"2008-01-18","07/08","06/07","05/06",null,"2008-01-18","07/08","06/07","05/06"]
["Opted Out of Pension (less than 3 months employer/payroll refunded)",null,null,null,null,null,null,"2008-01-19","07/08","06/07","05/06",null,"2008-01-19","07/08","06/07","05/06"]
["Opted Out of Pension (over 3 months, LPP to refund)",null,null,null,null,null,null,"2008-01-20","07/08","06/07","05/06",null,"2008-01-20","07/08","06/07","05/06"]
["End of Fixed Term Contract",null,null,null,null,null,null,"2008-01-21","07/08","06/07","05/06",null,"2008-01-21","07/08","06/07","05/06"]
["Dismissal",null,null,null,null,null,null,"2008-01-22","07/08","06/07","05/06",null,"2008-01-22","07/08","06/07","05/06"]
["Voluntary Early Retirement (age 55+, possible reductions)",null,null,null,null,null,null,"2008-01-23","07/08","06/07","05/06",null,"2008-01-23","07/08","06/07","05/06"]
["Normal Pension Age (SPA or 65)",null,null,null,null,null,null,"2008-01-24","07/08","06/07","05/06",null,"2008-01-24","07/08","06/07","05/06"]
["Late Retirement (after age 65)",null,null,null,null,null,null,"2008-01-25","07/08","06/07","05/06",null,"2008-01-25","07/08","06/07","05/06"]
["Redundancy (under 55 - NO pension)",null,null,null,null,null,null,"2008-01-26","07/08","06/07","05/06",null,"2008-01-26","07/08","06/07","05/06"]
["Redundancy (over 55 - with pension)",null,null,null,null,null,null,"2008-01-27","07/08","06/07","05/06",null,"2008-01-27","07/08","06/07","05/06"]
["Efficiency of Service (under 55 - NO pension)",null,null,null,null,null,null,"2008-01-28","07/08","06/07","05/06",null,"2008-01-28","07/08","06/07","05/06"]
["Efficiency of Service (over 55 - with pension)",null,null,null,null,null,null,"2008-01-29","07/08","06/07","05/06",null,"2008-01-29","07/08","06/07","05/06"]
["Flexible Retirement (reductions waived)",null,null,null,null,null,null,"2008-01-30","07/08","06/07","05/06",null,"2008-01-30","07/08","06/07","05/06"]
["Flexible Retirement (reductions applied)",null,null,null,null,null,null,"2008-01-31","07/08","06/07","05/06",null,"2008-01-31","07/08","06/07","05/06"]
["Ill Health - Tier 1",null,null,null,null,null,null,"2008-02-01","07/08","06/07","05/06",null,"2008-02-01","07/08","06/07","05/06"]
["Ill Health - Tier 2",null,null,null,null,null,null,"2008-02-02","07/08","06/07","05/06",null,"2008-02-02","07/08","06/07","05/06"]
["Ill Health - Tier 3",null,null,null,null,null,null,"2008-02-03","07/08","06/07","05/06",null,"2008-02-03","07/08","06/07","05/06"]
["Death in Service (confirm Assumed Pensionable Pay in comments)",null,null,null,null,null,null,"2008-02-04","07/08","06/07","05/06",null,"2008-02-04","07/08","06/07","05/06"]
["TUPE Transfer (state new employer, if known below)",null,null,null,null,null,null,"2008-02-05","07/08","06/07","05/06",null,"2008-02-05","07/08","06/07","05/06"]
["Age 65 - Underpin",null,null,null,null,null,null,"2008-02-06","07/08","06/07","05/06",null,"2008-02-06","07/08","06/07","05/06"]
[null,null,null,null,null,null,null,"2008-02-07","07/08","06/07","05/06",null,"2008-02-07","07/08","06/07","05/06"]
[{"$f":"IF('Employee Details'!$B17=\"\",\"\",EDATE('Employee Details'!$B$17,-12))","v":""},null,null,null,null,null,null,"2008-02-08","07/08","06/07","05/06",null,"2008-02-08","07/08","06/07","05/06"]
{"$rows_left_out":4806}