{"text_format":"1","workbook":"xlsx","n_sheets":5,"sheets":["Employee Details","Calculation Sheet","Extras","Leaver Form","Options"],"not_rendered":{"charts":0,"images":1,"macros":1,"external_links":0,"defined_names":5,"comments":2,"pivot_tables":0},"unopened":[],"bounds":{"document_bytes":16777216,"sheet_cells":100000,"rows_first":2000,"rows_last":500,"rows_between":2000,"halvings":0,"cell_chars":16384,"cell_head_chars":4096},"cells_cut":0,"cells_raw":0,"read":"whole","date_system":"1900"}

{"sheet":"Employee Details","index":0,"n_rows":31,"n_cols":6,"rows_kept":31,"cut":false,"hidden":false,"merged":[[23,0,24,1],[0,1,4,1],[15,2,15,4],[16,2,18,4],[19,2,19,7],[16,5,18,9]]}
[null,"Employee Details"]
[]
[]
[]
[]
["Which LGPS fund is membership of ?"]
["Surname"]
["Forename(s)"]
["Employees Personal Email Address (if known)"]
["Date of Birth"]
["National Insurance No"]
["Pay reference"]
["Does the employee have more than one pensionable employment"]
[{"$f":"IF(B13=\"Yes\",\"Please confirm hours/term-time weeks of post to be terminated\",\"\")","v":""}]
["Did the pensionable employment start on or after 01/04/2014 (CARE scheme only)"]
[{"$f":"IF(B15=\"Yes\",\"Please confirm FTE* pay of post to be terminated - CARE scheme only\",\"\")","v":""},null,{"$f":"IF(A16=\"Please confirm FTE* pay of post to be terminated - CARE scheme only\",\" *Full time equivalent rate of pay\",\"\")","v":""}]
["Date of Termination",null,{"$f":"IF(OR(B18=\"Redundancy (over 55 - with pension)\",B18=\"Flexible Retirement (reductions waived)\",B18=\"Efficiency of Service (over 55 - with pension)\"),\"WARNING PENSION STRAIN COST MAY APPLY\",\" \")","v":" "},null,null,{"$f":"IF(B18=\"Dismissal\",\"If dismissal due to fraudulent character or grave misconduct, pension benefits can be withheld. Please confirm in comments section, if you wish to exercise this right.\",\" \")","v":" "}]
["Reason For Termination"]
[{"$f":"IF(B18=\"Flexible Retirement (reductions waived)\",\"Flexible Retirements Only - Please confirm the member has had a reduction in pay (grade) or hours\",IF(B18=\"Flexible Retirement (reductions applied)\",\"Flexible Retirements Only - Please confirm the member has had a reduction in pay (grade) or hours\",\"\"))","v":""}]
[{"$f":"IF(B18=\"TUPE transfer (state new employer, if known below)\",\"New Employer (TUPE leavers only, if known)\",\"\")","v":""}]
[{"$f":"IF(B15=\"yes\",\"\",\"Is final pay period a previous corresponding year?\")","v":"Is final pay period a previous corresponding year?"}]
[{"$f":"IF(B21=\"Yes\",\"Please confirm date of previous corresponding year\",\"\")","v":""}]
[]
[{"$f":"VLOOKUP(B28,A29:B31,2,0)","v":"Not all mandatory fields completed"}]
[]
[{"$f":"IF(COUNTA(B6,B7,B8,B10,B11,B12,B13,B15,B16,B17,B18)=11,\"completed\",\"not all completed\")","v":"not all completed"},{"$f":"IF(A26=\"not all completed\",0,1)","v":0}]
[{"$f":"IF(COUNTA(B6,B7,B8,B10,B11,B12,B13,B15,B17,B18,B21)=11,\"completed\",\"not all completed\")","v":"not all completed"},{"$f":"IF(A27=\"not all completed\",0,2)","v":0}]
[null,{"$f":"MAX(B26:B27)","v":0}]
[0,"Not all mandatory fields completed"]
[1,"All mandatory fields completed, move on to Calculation Sheet"]
[2,"All mandatory fields completed, move on to Calculation Sheet"]

{"sheet":"Calculation Sheet","index":1,"n_rows":383,"n_cols":20,"rows_kept":383,"cut":false,"hidden":false,"merged":[[3,0,3,1],[20,12,20,14],[5,15,5,17],[38,16,38,17],[23,12,23,14],[31,13,31,17],[32,13,32,17],[30,13,30,17],[29,13,29,17],[9,19,9,24],[15,19,15,24],[16,19,16,24],[12,19,12,24],[13,19,13,24],[14,19,14,24],[10,19,10,24],[11,19,11,24],[59,0,59,1],[27,12,27,15],[24,12,26,14],[24,15,26,15],[21,0,28,10],[21,12,21,14],[22,13,22,15],[0,0,1,9],[0,10,1,14],[19,0,19,10],[20,0,20,10],[47,14,47,15],[4,0,4,1],[3,7,3,12],[3,13,3,14],[3,3,3,4],[2,13,2,14],[2,2,2,9],[3,5,3,6],[2,10,2,12],[5,0,5,1],[6,0,6,1],[2,0,2,1]]}
[{"$f":"CONCATENATE(\"Name\",\":\",\" \",'Employee Details'!B7, \",\", \" \",'Employee Details'!B8,\" \", \" \", \"NINO\",\":\",\" \",'Employee Details'!B11,\" \",\" \",\"Pay ref\",\":\", \" \",,'Employee Details'!B12)","v":"Name: ,   NINO:   Pay ref: "},null,null,null,null,null,null,null,null,null,{"$f":"IF('Employee Details'!B6=0,\"\",'Employee Details'!B6)","v":""}]
[]
[{"$f":"'Employee Details'!A18","v":"Reason For Termination"},null,{"$f":"IF('Employee Details'!B18=0,\"\",'Employee Details'!B18)","v":""},null,null,null,null,null,null,null,{"$f":"'Employee Details'!A17","v":"Date of Termination"},null,null,{"$f":"IF('Employee Details'!B17=0,\"\",'Employee Details'!B17)","v":""}]
[{"$f":"'Employee Details'!A21","v":"Is final pay period a previous corresponding year?"},null,{"$f":"IF('Employee Details'!B21=0,\"\",'Employee Details'!B21)","v":""},{"$f":"'Employee Details'!A22","v":""},null,{"$f":"IF('Employee Details'!B22=0,\"\",'Employee Details'!B22)","v":""},null,"FTE (Final Salary/Scale Point/Gradestep) of Post to be Terminated",null,null,null,null,null,{"$f":"IF('Employee Details'!B16<>\"\",'Employee Details'!B16,(IF(K1=\"Lancashire County Pension Fund\",'Calculation Sheet'!B10*12*('Calculation Sheet'!N10/'Calculation Sheet'!M10)*('Calculation Sheet'!P10/'Calculation Sheet'!O10),IF(K1=\"Cumbria County LGPS\",'Calculation Sheet'!B10*12*('Calculation Sheet'!N10/'Calculation Sheet'!M10)))))","v":false}]
["Pensionable Pay due/paid after date of leaving (if applicable)(CARE scheme)"]
["Month"]
["Amount(£)"]
[]
[null,"MONTHLY BASIC PAY (salary)","START DATE","END DATE","Days Worked in Start Month","Days Worked in End Month","Complete Calendar Months Worked","Days","Months","Years",null,"Pay in Period","Contractual Weekly Hours","FTE Hours (i.e. 36.25/37.00 etc.)","Contractual Weeks (term-time weeks if applicable) ","FTE weeks (52 OR 52.143 etc.)","FTE PAY","P/T HRS (INCLUDING SCALED DOWN IF TERM-TIME) ","Calc column"]
["(Latest date at top)",null,null,null,null,null,null,null,null,null,null,null,null,null,null,null,null,{"$f":"IF(M10=0,\"\",M10/P10*O10)","v":""},null,{"$f":"IF(AND(B10<>\"\",OR(C10=\"\",D10=\"\",M10=\"\",N10=\"\",O10=\"\",P10=\"\")),\"WARNING CHECK ALL COLUMNS COMPLETED\",\"\")","v":""}]
["(dd/mm/yy)",null,null,null,null,null,null,null,null,null,null,null,null,null,null,null,null,{"$f":"IF(M11=0,\"\",M11/P11*O11)","v":""},{"$f":"IF(B11=0,\"\",+C10-D11-1)","v":""},{"$f":"IF(AND(B11<>\"\",OR(C11=\"\",D11=\"\",M11=\"\",N11=\"\",O11=\"\",P11=\"\")),\"WARNING CHECK ALL COLUMNS COMPLETED\",\"\")","v":""}]
[null,null,null,null,null,null,null,null,null,null,null,null,null,null,null,null,null,{"$f":"IF(M12=0,\"\",M12/P12*O12)","v":""},{"$f":"IF(B12=0,\"\",+C11-D12-1)","v":""},{"$f":"IF(AND(B12<>\"\",OR(C12=\"\",D12=\"\",M12=\"\",N12=\"\",O12=\"\",P12=\"\")),\"WARNING CHECK ALL COLUMNS COMPLETED\",\"\")","v":""}]
[null,null,null,null,null,null,null,null,null,null,null,null,null,null,null,null,null,{"$f":"IF(M13=0,\"\",M13/P13*O13)","v":""},"",{"$f":"IF(AND(B13<>\"\",OR(C13=\"\",D13=\"\",M13=\"\",N13=\"\",O13=\"\",P13=\"\")),\"WARNING CHECK ALL COLUMNS COMPLETED\",\"\")","v":""}]
[null,null,null,null,null,null,null,null,null,null,null,null,null,null,null,null,null,"","",""]
[null,null,null,null,null,null,null,null,null,null,null,null,null,null,null,null,null,"","",""]
[null,null,null,null,null,null,null,null,null,null,null,null,null,null,null,null,null,"","",""]
[null,null,null,null,null,null,null,null,null,null,null,null,null,null,null,null,null,"","",""]
[null,null,null,null,31,null,null,null,null,null,31,null,null,null,null,null,{"$f":"SUM(Q10:Q17)","v":0},null,{"$f":"SUM(S10:S17)","v":0}]
[]
["Additional Comments (any comments to assist LPPA in processing the pension benefits)"]
["Examples:- Assumed Pensionable Pay (APP) amounts, APP dates, Leave Without Pay dates, maternity dates",null,null,null,null,null,null,null,null,null,null,null,"SCALED UP EXTRAS",null,null,{"$f":"Extras!A19","v":0}]
[null,null,null,null,null,null,null,null,null,null,null,null,"NON SCALED UP EXTRAS",null,null,{"$f":"Extras!A33","v":0}]
[null,null,null,null,null,null,null,null,null,null,null,null,null,"EXTRAS SUBTOTAL",null,null,{"$f":"SUM(P21:P23)","v":0}]
[null,null,null,null,null,null,null,null,null,null,null,null,"AD-HOC EXTRAS",null,null,{"$f":"Extras!A42","v":0}]
[null,null,null,null,null,null,null,null,null,null,null,null,"SCALED UP FACTOR (IF FINAL PAY PERIOD <365 DAYS)"]
[]
[]
[null,null,null,null,null,null,null,null,null,null,null,null,"TOTAL FINAL PAY for calculating pension benefits (pre April 2014 benefits only)",null,null,null,{"$f":"SUM((Q18+Q23)*P25)+P24","v":0}]
[]
[null,null,null,null,null,null,null,null,null,null,null,null,"Completed By"]
[null,null,null,null,null,null,null,null,null,null,null,null,"Email Address"]
[null,null,null,null,null,null,null,null,null,null,null,null,"Contact no."]
[null,null,null,null,null,null,null,null,null,null,null,null,"Date"]
[]
[]
[]
[]
[]
[]
[]
[]
[]
[]
[]
[]
[]
[]
[]
[]
[]
[]
[]
[]
[]
[]
[]
[]
[]
[]
[{"$f":"IF('Employee Details'!B17=\"\",\"\",'Employee Details'!B17)","v":""}]
[]
[]
[]
[]
[]
[]
[]
[]
[]
[]
[]
[]
[]
[]
[]
[]
[]
[]
[]
[]
[]
[]
[]
[]
[]
[]
[]
[]
[]
[]
[]
[]
[]
[]
[]
[]
[]
[]
[]
[]
[]
[]
[]
[]
[]
["200211",30]
["200212",31]
["200301",31]
["200302",28]
["200303",31]
["200304",30]
["200305",31]
["200306",30]
["200307",31]
["200308",31]
["200309",30]
["200310",31]
["200311",30]
["200312",31]
["200401",31]
["200402",29]
["200403",31]
["200404",30]
["200405",31]
["200406",30]
["200407",31]
["200408",31]
["200409",30]
["200410",31]
["200411",30]
["200412",31]
["200501",31]
["200502",28]
["200503",31]
["200504",30]
["200505",31]
["200506",30]
["200507",31]
["200508",31]
["200509",30]
["200510",31]
["200511",30]
["200512",31]
["200601",31]
["200602",28]
["200603",31]
["200604",30]
["200605",31]
["200606",30]
["200607",31]
["200608",31]
["200609",30]
["200610",31]
["200611",30]
["200612",31]
["200701",31]
["200702",28]
["200703",31]
["200704",30]
["200705",31]
["200706",30]
["200707",31]
["200708",31]
["200709",30]
["200710",31]
["200711",30]
["200712",31]
["200801",31]
["200802",29]
["200803",31]
["200804",30]
["200805",31]
["200806",30]
["200807",31]
["200808",31]
["200809",30]
["200810",31]
["200811",30]
["200812",31]
["200901",31]
["200902",28]
["200903",31]
["200904",30]
["200905",31]
["200906",30]
["200907",31]
["200908",31]
["200909",30]
["200910",31]
["200911",30]
["200912",31]
["201001",31]
["201002",28]
["201003",31]
["201004",30]
["201005",31]
["201006",30]
["201007",31]
["201008",31]
["201009",30]
["201010",31]
["201011",30]
["201012",31]
["201101",31]
["201102",28]
["201103",31]
["201104",30]
["201105",31]
["201106",30]
["201107",31]
["201108",31]
["201109",30]
["201110",31]
["201111",30]
["201112",31]
["201201",31]
["201202",29]
["201203",31]
["201204",30]
["201205",31]
["201206",30]
["201207",31]
["201208",31]
["201209",30]
["201210",31]
["201211",30]
["201212",31]
["201301",31]
["201302",28]
["201303",31]
["201304",30]
["201305",31]
["201306",30]
["201307",31]
["201308",31]
["201309",30]
["201310",31]
["201311",30]
["201312",31]
["201401",31]
["201402",28]
["201403",31]
["201404",30]
["201405",31]
["201406",30]
["201407",31]
["201408",31]
["201409",30]
["201410",31]
["201411",30]
["201412",31]
["201501",31]
["201502",28]
["201503",31]
["201504",30]
["201505",31]
["201506",30]
["201507",31]
["201508",31]
["201509",30]
["201510",31]
["201511",30]
["201512",31]
["201601",31]
["201602",29]
["201603",31]
["201604",30]
["201605",31]
["201606",30]
["201607",31]
["201608",31]
["201609",30]
["201610",31]
["201611",30]
["201612",31]
["201701",31]
["201702",28]
["201703",31]
["201704",30]
["201705",31]
["201706",30]
["201707",31]
["201708",31]
["201709",30]
["201710",31]
["201711",30]
["201712",31]
["201801",31]
["201802",28]
["201803",31]
["201804",30]
["201805",31]
["201806",30]
["201807",31]
["201808",31]
["201809",30]
["201810",31]
["201811",30]
["201812",31]
["201901",31]
["201902",28]
["201903",31]
["201904",30]
["201905",31]
["201906",30]
["201907",31]
["201908",31]
["201909",30]
["201910",31]
["201911",30]
["201912",31]
["202001",31]
["202002",29]
["202003",31]
["202004",30]
["202005",31]
["202006",30]
["202007",31]
["202008",31]
["202009",30]
["202010",31]
["202011",30]
["202012",31]
["202101",31]
["202102",28]
["202103",31]
["202104",30]
["202105",31]
["202106",30]
["202107",31]
["202108",31]
["202109",30]
["202110",31]
["202111",30]
["202112",31]
["202201",31]
["202202",28]
["202203",31]
["202204",30]
["202205",31]
["202206",30]
["202207",31]
["202208",31]
["202209",30]
["202210",31]
["202211",30]
["202212",31]
["202301",31]
["202302",28]
["202303",31]
["202304",30]
["202305",31]
["202306",30]
["202307",31]
["202308",31]
["202309",30]
["202310",31]
["202311",30]
["202312",31]
["202401",31]
["202402",29]
["202403",31]
["202404",30]
["202405",31]
["202406",30]
["202407",31]
["202408",31]
["202409",30]
["202410",31]
["202411",30]
["202412",31]
["202501",31]
["202502",28]
["202503",31]
["202504",30]
["202505",31]
["202506",30]
["202507",31]
["202508",31]
["202509",30]
["202510",31]
["202511",30]
["202512",31]

{"sheet":"Extras","index":2,"n_rows":60,"n_cols":14,"rows_kept":60,"cut":false,"hidden":false,"merged":[[44,12,44,13],[6,0,7,0],[0,9,1,13],[0,0,1,8],[2,12,2,13],[2,9,2,11],[2,1,2,8]]}
[{"$f":"CONCATENATE(\"Name\",\":\",\" \",'Employee Details'!B7, \",\", \" \",'Employee Details'!B8,\" \", \" \", \"NINO\",\":\",\" \",'Employee Details'!B11,\" \",\" \",\"Pay ref\",\":\", \" \",,'Employee Details'!B12)","v":"Name: ,   NINO:   Pay ref: "},null,null,null,null,null,null,null,null,{"$f":"'Employee Details'!$B$6","v":0}]
[]
[{"$f":"'Employee Details'!A18","v":"Reason For Termination"},{"$f":"IF('Employee Details'!B18=0,\"\",'Employee Details'!B18)","v":""},null,null,null,null,null,null,null,{"$f":"'Employee Details'!A17","v":"Date of Termination"},null,null,{"$f":"IF('Employee Details'!B17=0,\"\",'Employee Details'!B17)","v":""}]
[]
[null,"END YEAR",null,null,null,null,null,null,null,null,null,null,"START YEAR"]
["SCALED UP EXTRAS",{"$f":"IF('Employee Details'!B17=\"\",\"\",YEAR('Employee Details'!B17))","v":""},null,null,null,null,null,null,null,null,null,null,{"$f":"IF(Options!A67=\"\",\"\",YEAR(Options!A67))","v":""}]
["Item\\Month",{"$f":"_xlfn.IFNA(VLOOKUP('Calculation Sheet'!A53,Options!$A54:$B65,2,FALSE),INDEX(Options!$B$54:$B$65,MATCH('Calculation Sheet'!A53,Options!$C$54:$C$65,0)))","v":"Dec"},{"$f":"_xlfn.IFNA(VLOOKUP('Calculation Sheet'!B53,Options!$A54:$B65,2,FALSE),INDEX(Options!$B$54:$B$65,MATCH('Calculation Sheet'!B53,Options!$C$54:$C$65,0)))","v":"Dec"},{"$f":"_xlfn.IFNA(VLOOKUP('Calculation Sheet'!C53,Options!$A54:$B65,2,FALSE),INDEX(Options!$B$54:$B$65,MATCH('Calculation Sheet'!C53,Options!$C$54:$C$65,0)))","v":"Dec"},{"$f":"_xlfn.IFNA(VLOOKUP('Calculation Sheet'!D53,Options!$A54:$B65,2,FALSE),INDEX(Options!$B$54:$B$65,MATCH('Calculation Sheet'!D53,Options!$C$54:$C$65,0)))","v":"Dec"},{"$f":"_xlfn.IFNA(VLOOKUP('Calculation Sheet'!E53,Options!$A54:$B65,2,FALSE),INDEX(Options!$B$54:$B$65,MATCH('Calculation Sheet'!E53,Options!$C$54:$C$65,0)))","v":"Dec"},{"$f":"_xlfn.IFNA(VLOOKUP('Calculation Sheet'!F53,Options!$A54:$B65,2,FALSE),INDEX(Options!$B$54:$B$65,MATCH('Calculation Sheet'!F53,Options!$C$54:$C$65,0)))","v":"Dec"},{"$f":"_xlfn.IFNA(VLOOKUP('Calculation Sheet'!G53,Options!$A54:$B65,2,FALSE),INDEX(Options!$B$54:$B$65,MATCH('Calculation Sheet'!G53,Options!$C$54:$C$65,0)))","v":"Dec"},{"$f":"_xlfn.IFNA(VLOOKUP('Calculation Sheet'!H53,Options!$A54:$B65,2,FALSE),INDEX(Options!$B$54:$B$65,MATCH('Calculation Sheet'!H53,Options!$C$54:$C$65,0)))","v":"Dec"},{"$f":"_xlfn.IFNA(VLOOKUP('Calculation Sheet'!I53,Options!$A54:$B65,2,FALSE),INDEX(Options!$B$54:$B$65,MATCH('Calculation Sheet'!I53,Options!$C$54:$C$65,0)))","v":"Dec"},{"$f":"_xlfn.IFNA(VLOOKUP('Calculation Sheet'!J53,Options!$A54:$B65,2,FALSE),INDEX(Options!$B$54:$B$65,MATCH('Calculation Sheet'!J53,Options!$C$54:$C$65,0)))","v":"Dec"},{"$f":"_xlfn.IFNA(VLOOKUP('Calculation Sheet'!K53,Options!$A54:$B65,2,FALSE),INDEX(Options!$B$54:$B$65,MATCH('Calculation Sheet'!K53,Options!$C$54:$C$65,0)))","v":"Dec"},{"$f":"_xlfn.IFNA(VLOOKUP('Calculation Sheet'!L53,Options!$A54:$B65,2,FALSE),INDEX(Options!$B$54:$B$65,MATCH('Calculation Sheet'!L53,Options!$C$54:$C$65,0)))","v":"Dec"},{"$f":"_xlfn.IFNA(VLOOKUP('Calculation Sheet'!M53,Options!$A54:$B65,2,FALSE),INDEX(Options!$B$54:$B$65,MATCH('Calculation Sheet'!M53,Options!$C$54:$C$65,0)))","v":"Dec"}]
[null,{"$f":"+'Calculation Sheet'!A$54","v":0},{"$f":"+'Calculation Sheet'!B$54","v":0},{"$f":"+'Calculation Sheet'!C$54","v":0},{"$f":"+'Calculation Sheet'!D$54","v":0},{"$f":"+'Calculation Sheet'!E$54","v":0},{"$f":"+'Calculation Sheet'!F$54","v":0},{"$f":"+'Calculation Sheet'!G$54","v":0},{"$f":"+'Calculation Sheet'!H$54","v":0},{"$f":"+'Calculation Sheet'!I$54","v":0},{"$f":"+'Calculation Sheet'!J$54","v":0},{"$f":"+'Calculation Sheet'!K$54","v":0},{"$f":"+'Calculation Sheet'!L$54","v":0},{"$f":"+'Calculation Sheet'!M$54","v":0}]
[]
[]
[]
[]
[]
[]
[]
[]
[]
[]
[{"$f":"SUM(B19:N19)","v":0},{"$f":"IF(SUM(B9:B18)=0,0,SUM(B9:B18)/B8)","v":0},{"$f":"IF(SUM(C9:C18)=0,0,SUM(C9:C18)/C8)","v":0},{"$f":"IF(SUM(D9:D18)=0,0,SUM(D9:D18)/D8)","v":0},0,0,0,0,0,0,0,0,0,{"$f":"IF(SUM(N9:N18)=0,0,SUM(N9:N18)/N8/A57*A58)","v":0}]
[]
["NON-SCALED UP EXTRAS"]
["Item\\Month",{"$f":"IF(B7=0,\"\",B7)","v":"Dec"},"Dec","Dec","Dec","Dec","Dec","Dec","Dec","Dec","Dec","Dec","Dec","Dec"]
[]
[]
[]
[]
[]
[]
[]
[]
[]
[]
[{"$f":"SUM(B33:N33)","v":0},{"$f":"IF(SUM(B23:B32)=0,0,SUM(B23:B32))","v":0},{"$f":"SUM(C23:C32)","v":0},{"$f":"SUM(D23:D32)","v":0},0,0,0,0,0,0,0,0,0,{"$f":"IF(SUM(N23:N32)=0,0,SUM(N23:N32)*A58/A57)","v":0}]
[]
["AD-HOC EXTRAS"]
["Item\\Month",{"$f":"IF(B7=0,\"\",B7)","v":"Dec"},"Dec","Dec","Dec","Dec","Dec","Dec","Dec","Dec","Dec","Dec","Dec",{"$f":"IF(N7=0,\"\",N7)","v":"Dec"}]
[]
[]
[]
[]
[]
[{"$f":"SUM(B42:N42)","v":0},{"$f":"IF(SUM(B37:B41)=0,0,SUM(B37:B41))","v":0},{"$f":"SUM(C37:C41)","v":0},0,0,0,0,0,0,0,0,0,{"$f":"SUM(M37:M41)","v":0},{"$f":"IF(SUM(N37:N41)=0,0,SUM(N37:N41)*A58/A57)","v":0}]
[]
[]
[]
[]
[]
[]
[]
[]
[]
[]
[]
[]
[]
[]
[{"$f":"+'Calculation Sheet'!K18","v":31},"No. of Days in Starting Month",null,null,{"$f":"IF('Calculation Sheet'!D10=0,\"\",EDATE('Calculation Sheet'!D10,-12))","v":""}]
[{"$f":"+'Calculation Sheet'!E18","v":31},"Days worked in Starting Month"]
[{"$f":"Options!A70","v":31},"No. of Days in End Month"]
[{"$f":"'Calculation Sheet'!F10","v":0},"Days worked in End Month"]

{"sheet":"Leaver Form","index":3,"n_rows":34,"n_cols":5,"rows_kept":34,"cut":false,"hidden":false,"merged":[[0,0,3,1],[27,4,30,6],[32,0,32,1],[33,0,33,1],[26,0,26,1]]}
["     Leaver Form"]
[]
[]
[]
[{"$f":"'Employee Details'!A6","v":"Which LGPS fund is membership of ?"},{"$f":"IF('Employee Details'!B6=\"\",\"\",'Employee Details'!B6)","v":""}]
[{"$f":"'Employee Details'!A7","v":"Surname"},{"$f":"IF('Employee Details'!B7=\"\",\"\",'Employee Details'!B7)","v":""}]
[{"$f":"'Employee Details'!A8","v":"Forename(s)"},{"$f":"IF('Employee Details'!B8=\"\",\"\",'Employee Details'!B8)","v":""}]
[{"$f":"'Employee Details'!A9","v":"Employees Personal Email Address (if known)"},{"$f":"IF('Employee Details'!B9=\"\",\"\",'Employee Details'!B9)","v":""}]
[{"$f":"'Employee Details'!A10","v":"Date of Birth"},{"$f":"IF('Employee Details'!B10=\"\",\"\",'Employee Details'!B10)","v":""}]
[{"$f":"'Employee Details'!A11","v":"National Insurance No"},{"$f":"IF('Employee Details'!B11=\"\",\"\",'Employee Details'!B11)","v":""}]
[{"$f":"'Employee Details'!A12","v":"Pay reference"},{"$f":"IF('Employee Details'!B12=\"\",\"\",'Employee Details'!B12)","v":""}]
[{"$f":"'Employee Details'!A13","v":"Does the employee have more than one pensionable employment"},{"$f":"IF('Employee Details'!B13=\"\",\"\",'Employee Details'!B13)","v":""}]
[{"$f":"'Employee Details'!A14","v":""},{"$f":"IF('Employee Details'!B14=\"\",\"\",'Employee Details'!B14)","v":""}]
[{"$f":"'Employee Details'!A17","v":"Date of Termination"},{"$f":"IF('Employee Details'!B17=\"\",\"\",'Employee Details'!B17)","v":""}]
[{"$f":"'Employee Details'!A18","v":"Reason For Termination"},{"$f":"IF('Employee Details'!B18=\"\",\"\",'Employee Details'!B18)","v":""}]
[{"$f":"'Employee Details'!A19","v":""},{"$f":"IF('Employee Details'!B19=\"\",\"\",'Employee Details'!B19)","v":""}]
[{"$f":"'Employee Details'!A20","v":""},{"$f":"IF('Employee Details'!B20=\"\",\"\",'Employee Details'!B20)","v":""}]
[]
[{"$f":"'Employee Details'!A15","v":"Did the pensionable employment start on or after 01/04/2014 (CARE scheme only)"},{"$f":"IF('Employee Details'!B15=\"\",\"\",'Employee Details'!B15)","v":""}]
[{"$f":"'Calculation Sheet'!H4","v":"FTE (Final Salary/Scale Point/Gradestep) of Post to be Terminated"},{"$f":"IF('Calculation Sheet'!N4=0,\"\",'Calculation Sheet'!N4)","v":false}]
[{"$f":"'Employee Details'!A21","v":"Is final pay period a previous corresponding year?"},{"$f":"IF('Employee Details'!B21=\"\",\"\",'Employee Details'!B21)","v":""}]
[{"$f":"'Employee Details'!A22","v":""},{"$f":"IF('Employee Details'!B22=\"\",\"\",'Employee Details'!B22)","v":""}]
[{"$f":"'Calculation Sheet'!M28","v":"TOTAL FINAL PAY for calculating pension benefits (pre April 2014 benefits only)"},{"$f":"IF('Calculation Sheet'!Q28=0,\"\",'Calculation Sheet'!Q28)","v":""}]
[{"$f":"'Calculation Sheet'!A5","v":"Pensionable Pay due/paid after date of leaving (if applicable)(CARE scheme)"},{"$f":"IF('Calculation Sheet'!C5=\"\",\"\",'Calculation Sheet'!C5)","v":""}]
[{"$f":"'Calculation Sheet'!A7","v":"Amount(£)"},{"$f":"IF('Calculation Sheet'!C7=\"\",\"\",'Calculation Sheet'!C7)","v":""}]
[{"$f":"'Calculation Sheet'!A20","v":"Additional Comments (any comments to assist LPPA in processing the pension benefits)"},{"$f":"IF('Calculation Sheet'!A22=\"\",\"\",'Calculation Sheet'!A22)","v":""}]
["I understand that the accuracy of this data is essential in order to calculate the member’s pension benefits and I confirm and represent that the above data is accurate and complete."]
["Authorised By",null,null,null,{"$f":"IF(OR(ISBLANK(B28),ISBLANK(B29),ISBLANK(B30),ISBLANK(B31)), \"All authorisation details must be completed or the form will not be accepted\", \"\")","v":"All authorisation details must be completed or the form will not be accepted"}]
["Email Address"]
["Contact no."]
["Date"]
[]
["Completed forms may be emailed to :-"]
["YPS.Forms@localpensionspartnership.org.uk"]

{"sheet":"Options","index":4,"n_rows":4846,"n_cols":16,"rows_kept":4846,"cut":false,"hidden":true,"merged":[]}
["Mr",null,null,null,null,null,null,"Date","Tax Year","Column1","Column2",null,"Date","Tax Year","Column1","Column2"]
["Mrs",null,null,null,null,null,null,"2008-01-01","07/08","06/07","05/06",null,"2008-01-01","07/08","06/07","05/06"]
["Miss",null,null,null,null,null,null,"2008-01-02","07/08","06/07","05/06",null,"2008-01-02","07/08","06/07","05/06"]
["Ms",null,null,null,null,null,null,"2008-01-03","07/08","06/07","05/06",null,"2008-01-03","07/08","06/07","05/06"]
["Dr",null,null,null,null,null,null,"2008-01-04","07/08","06/07","05/06",null,"2008-01-04","07/08","06/07","05/06"]
["Other",null,null,null,null,null,null,"2008-01-05","07/08","06/07","05/06",null,"2008-01-05","07/08","06/07","05/06"]
[null,null,null,null,null,null,null,"2008-01-06","07/08","06/07","05/06",null,"2008-01-06","07/08","06/07","05/06"]
[null,null,null,null,null,null,null,"2008-01-07","07/08","06/07","05/06",null,"2008-01-07","07/08","06/07","05/06"]
["Single",null,null,null,null,null,null,"2008-01-08","07/08","06/07","05/06",null,"2008-01-08","07/08","06/07","05/06"]
["Married",null,null,null,null,null,null,"2008-01-09","07/08","06/07","05/06",null,"2008-01-09","07/08","06/07","05/06"]
["Civil Partner",null,null,null,null,null,null,"2008-01-10","07/08","06/07","05/06",null,"2008-01-10","07/08","06/07","05/06"]
["Divorced",null,null,null,null,null,null,"2008-01-11","07/08","06/07","05/06",null,"2008-01-11","07/08","06/07","05/06"]
["Separated",null,null,null,null,null,null,"2008-01-12","07/08","06/07","05/06",null,"2008-01-12","07/08","06/07","05/06"]
["Nominated Co-Habiting Partner",null,null,null,null,null,null,"2008-01-13","07/08","06/07","05/06",null,"2008-01-13","07/08","06/07","05/06"]
[null,null,null,null,null,null,null,"2008-01-14","07/08","06/07","05/06",null,"2008-01-14","07/08","06/07","05/06"]
["Yes",null,null,null,null,null,null,"2008-01-15","07/08","06/07","05/06",null,"2008-01-15","07/08","06/07","05/06"]
["No",null,null,null,null,null,null,"2008-01-16","07/08","06/07","05/06",null,"2008-01-16","07/08","06/07","05/06"]
[null,null,null,null,null,null,null,"2008-01-17","07/08","06/07","05/06",null,"2008-01-17","07/08","06/07","05/06"]
["Resignation",null,null,null,null,null,null,"2008-01-18","07/08","06/07","05/06",null,"2008-01-18","07/08","06/07","05/06"]
["Opted Out of Pension (less than 3 months employer/payroll refunded)",null,null,null,null,null,null,"2008-01-19","07/08","06/07","05/06",null,"2008-01-19","07/08","06/07","05/06"]
["Opted Out of Pension (over 3 months, LPP to refund)",null,null,null,null,null,null,"2008-01-20","07/08","06/07","05/06",null,"2008-01-20","07/08","06/07","05/06"]
["End of Fixed Term Contract",null,null,null,null,null,null,"2008-01-21","07/08","06/07","05/06",null,"2008-01-21","07/08","06/07","05/06"]
["Dismissal",null,null,null,null,null,null,"2008-01-22","07/08","06/07","05/06",null,"2008-01-22","07/08","06/07","05/06"]
["Voluntary Early Retirement (age 55+, possible reductions)",null,null,null,null,null,null,"2008-01-23","07/08","06/07","05/06",null,"2008-01-23","07/08","06/07","05/06"]
["Normal Pension Age (SPA or 65)",null,null,null,null,null,null,"2008-01-24","07/08","06/07","05/06",null,"2008-01-24","07/08","06/07","05/06"]
["Late Retirement (after age 65)",null,null,null,null,null,null,"2008-01-25","07/08","06/07","05/06",null,"2008-01-25","07/08","06/07","05/06"]
["Redundancy (under 55 - NO pension)",null,null,null,null,null,null,"2008-01-26","07/08","06/07","05/06",null,"2008-01-26","07/08","06/07","05/06"]
["Redundancy (over 55 - with pension)",null,null,null,null,null,null,"2008-01-27","07/08","06/07","05/06",null,"2008-01-27","07/08","06/07","05/06"]
["Efficiency of Service (under 55 - NO pension)",null,null,null,null,null,null,"2008-01-28","07/08","06/07","05/06",null,"2008-01-28","07/08","06/07","05/06"]
["Efficiency of Service (over 55 - with pension)",null,null,null,null,null,null,"2008-01-29","07/08","06/07","05/06",null,"2008-01-29","07/08","06/07","05/06"]
["Flexible Retirement (reductions waived)",null,null,null,null,null,null,"2008-01-30","07/08","06/07","05/06",null,"2008-01-30","07/08","06/07","05/06"]
["Flexible Retirement (reductions applied)",null,null,null,null,null,null,"2008-01-31","07/08","06/07","05/06",null,"2008-01-31","07/08","06/07","05/06"]
["Ill Health - Tier 1",null,null,null,null,null,null,"2008-02-01","07/08","06/07","05/06",null,"2008-02-01","07/08","06/07","05/06"]
["Ill Health - Tier 2",null,null,null,null,null,null,"2008-02-02","07/08","06/07","05/06",null,"2008-02-02","07/08","06/07","05/06"]
["Ill Health - Tier 3",null,null,null,null,null,null,"2008-02-03","07/08","06/07","05/06",null,"2008-02-03","07/08","06/07","05/06"]
["Death in Service (confirm Assumed Pensionable Pay in comments)",null,null,null,null,null,null,"2008-02-04","07/08","06/07","05/06",null,"2008-02-04","07/08","06/07","05/06"]
["TUPE Transfer (state new employer, if known below)",null,null,null,null,null,null,"2008-02-05","07/08","06/07","05/06",null,"2008-02-05","07/08","06/07","05/06"]
["Age 65 - Underpin",null,null,null,null,null,null,"2008-02-06","07/08","06/07","05/06",null,"2008-02-06","07/08","06/07","05/06"]
[null,null,null,null,null,null,null,"2008-02-07","07/08","06/07","05/06",null,"2008-02-07","07/08","06/07","05/06"]
[{"$f":"IF('Employee Details'!$B17=\"\",\"\",EDATE('Employee Details'!$B$17,-12))","v":""},null,null,null,null,null,null,"2008-02-08","07/08","06/07","05/06",null,"2008-02-08","07/08","06/07","05/06"]
[{"$f":"IF('Employee Details'!$B17=\"\",\"\",EDATE('Employee Details'!$B17,-24))","v":""},null,null,null,null,null,null,"2008-02-09","07/08","06/07","05/06",null,"2008-02-09","07/08","06/07","05/06"]
[null,null,null,null,null,null,null,"2008-02-10","07/08","06/07","05/06",null,"2008-02-10","07/08","06/07","05/06"]
["Lancashire County Pension Fund",null,null,null,null,null,null,"2008-02-11","07/08","06/07","05/06",null,"2008-02-11","07/08","06/07","05/06"]
["Cumbria County LGPS",null,null,null,null,null,null,"2008-02-12","07/08","06/07","05/06",null,"2008-02-12","07/08","06/07","05/06"]
[null,null,null,null,null,null,null,"2008-02-13","07/08","06/07","05/06",null,"2008-02-13","07/08","06/07","05/06"]
[null,null,null,null,null,null,null,"2008-02-14","07/08","06/07","05/06",null,"2008-02-14","07/08","06/07","05/06"]
[null,null,null,null,null,null,null,"2008-02-15","07/08","06/07","05/06",null,"2008-02-15","07/08","06/07","05/06"]
[null,null,null,null,null,null,null,"2008-02-16","07/08","06/07","05/06",null,"2008-02-16","07/08","06/07","05/06"]
[null,null,null,null,null,null,null,"2008-02-17","07/08","06/07","05/06",null,"2008-02-17","07/08","06/07","05/06"]
[null,null,null,null,null,null,null,"2008-02-18","07/08","06/07","05/06",null,"2008-02-18","07/08","06/07","05/06"]
[null,null,null,null,null,null,null,"2008-02-19","07/08","06/07","05/06",null,"2008-02-19","07/08","06/07","05/06"]
[null,null,null,null,null,null,null,"2008-02-20","07/08","06/07","05/06",null,"2008-02-20","07/08","06/07","05/06"]
["CARE - IF JULY HAS SCALED UP EMOLS CHECK THAT THE SCALED UP AMOUNT IS CORRECT",null,null,null,null,null,null,"2008-02-21","07/08","06/07","05/06",null,"2008-02-21","07/08","06/07","05/06"]
[1,"Jan",-11,null,null,null,null,"2008-02-22","07/08","06/07","05/06",null,"2008-02-22","07/08","06/07","05/06"]
[2,"Feb",-10,null,null,null,null,"2008-02-23","07/08","06/07","05/06",null,"2008-02-23","07/08","06/07","05/06"]
[3,"Mar",-9,null,null,null,null,"2008-02-24","07/08","06/07","05/06",null,"2008-02-24","07/08","06/07","05/06"]
[4,"Apr",-8,null,null,null,null,"2008-02-25","07/08","06/07","05/06",null,"2008-02-25","07/08","06/07","05/06"]
[5,"May",-7,null,null,null,null,"2008-02-26","07/08","06/07","05/06",null,"2008-02-26","07/08","06/07","05/06"]
[6,"Jun",-6,null,null,null,null,"2008-02-27","07/08","06/07","05/06",null,"2008-02-27","07/08","06/07","05/06"]
[7,"Jul",-5,null,null,null,null,"2008-02-28","07/08","06/07","05/06",null,"2008-02-28","07/08","06/07","05/06"]
[8,"Aug",-4,null,null,null,null,"2008-02-29","07/08","06/07","05/06",null,"2008-02-29","07/08","06/07","05/06"]
[9,"Sep",-3,null,null,null,null,"2008-03-01","07/08","06/07","05/06",null,"2008-03-01","07/08","06/07","05/06"]
[10,"Oct",-2,null,null,null,null,"2008-03-02","07/08","06/07","05/06",null,"2008-03-02","07/08","06/07","05/06"]
[11,"Nov",-1,null,null,null,null,"2008-03-03","07/08","06/07","05/06",null,"2008-03-03","07/08","06/07","05/06"]
[12,"Dec",0,null,null,null,null,"2008-03-04","07/08","06/07","05/06",null,"2008-03-04","07/08","06/07","05/06"]
[null,null,null,null,null,null,null,"2008-03-05","07/08","06/07","05/06",null,"2008-03-05","07/08","06/07","05/06"]
[{"$f":"IF('Calculation Sheet'!D10=0,\"\",EDATE('Calculation Sheet'!D10,-12))","v":""},null,null,null,null,null,null,"2008-03-06","07/08","06/07","05/06",null,"2008-03-06","07/08","06/07","05/06"]
[null,null,null,null,null,null,null,"2008-03-07","07/08","06/07","05/06",null,"2008-03-07","07/08","06/07","05/06"]
[{"$f":"MONTH('Employee Details'!B17)","v":1},null,null,null,null,null,null,"2008-03-08","07/08","06/07","05/06",null,"2008-03-08","07/08","06/07","05/06"]
[{"$f":"_xlfn.IFNA(VLOOKUP(A69,Options!$A72:$D83,4,FALSE),INDEX(Options!$B$72:$B$83,MATCH(A69,Options!$C$72:$D$83,0)))","v":31},null,null,null,null,null,null,"2008-03-09","07/08","06/07","05/06",null,"2008-03-09","07/08","06/07","05/06"]
[null,null,null,null,null,null,null,"2008-03-10","07/08","06/07","05/06",null,"2008-03-10","07/08","06/07","05/06"]
[1,"Jan",-11,31,null,null,null,"2008-03-11","07/08","06/07","05/06",null,"2008-03-11","07/08","06/07","05/06"]
[2,"Feb",-10,28,null,null,null,"2008-03-12","07/08","06/07","05/06",null,"2008-03-12","07/08","06/07","05/06"]
[3,"Mar",-9,31,null,null,null,"2008-03-13","07/08","06/07","05/06",null,"2008-03-13","07/08","06/07","05/06"]
[4,"Apr",-8,30,null,null,null,"2008-03-14","07/08","06/07","05/06",null,"2008-03-14","07/08","06/07","05/06"]
[5,"May",-7,31,null,null,null,"2008-03-15","07/08","06/07","05/06",null,"2008-03-15","07/08","06/07","05/06"]
[6,"Jun",-6,30,null,null,null,"2008-03-16","07/08","06/07","05/06",null,"2008-03-16","07/08","06/07","05/06"]
[7,"Jul",-5,31,null,null,null,"2008-03-17","07/08","06/07","05/06",null,"2008-03-17","07/08","06/07","05/06"]
[8,"Aug",-4,31,null,null,null,"2008-03-18","07/08","06/07","05/06",null,"2008-03-18","07/08","06/07","05/06"]
[9,"Sep",-3,30,null,null,null,"2008-03-19","07/08","06/07","05/06",null,"2008-03-19","07/08","06/07","05/06"]
[10,"Oct",-2,31,null,null,null,"2008-03-20","07/08","06/07","05/06",null,"2008-03-20","07/08","06/07","05/06"]
[11,"Nov",-1,30,null,null,null,"2008-03-21","07/08","06/07","05/06",null,"2008-03-21","07/08","06/07","05/06"]
[12,"Dec",0,31,null,null,null,"2008-03-22","07/08","06/07","05/06",null,"2008-03-22","07/08","06/07","05/06"]
[null,null,null,null,null,null,null,"2008-03-23","07/08","06/07","05/06",null,"2008-03-23","07/08","06/07","05/06"]
[null,null,null,null,null,null,null,"2008-03-24","07/08","06/07","05/06",null,"2008-03-24","07/08","06/07","05/06"]
[null,null,null,null,null,null,null,"2008-03-25","07/08","06/07","05/06",null,"2008-03-25","07/08","06/07","05/06"]
[null,null,null,null,null,null,null,"2008-03-26","07/08","06/07","05/06",null,"2008-03-26","07/08","06/07","05/06"]
[null,null,null,null,null,null,null,"2008-03-27","07/08","06/07","05/06",null,"2008-03-27","07/08","06/07","05/06"]
[null,null,null,null,null,null,null,"2008-03-28","07/08","06/07","05/06",null,"2008-03-28","07/08","06/07","05/06"]
[null,null,null,null,null,null,null,"2008-03-29","07/08","06/07","05/06",null,"2008-03-29","07/08","06/07","05/06"]
[null,null,null,null,null,null,null,"2008-03-30","07/08","06/07","05/06",null,"2008-03-30","07/08","06/07","05/06"]
[null,null,null,null,null,null,null,"2008-03-31","07/08","06/07","05/06",null,"2008-03-31","07/08","06/07","05/06"]
[null,null,null,null,null,null,null,"2008-04-01","07/08","06/07","05/06",null,"2008-04-01","07/08","06/07","05/06"]
[null,null,null,null,null,null,null,"2008-04-02","07/08","06/07","05/06",null,"2008-04-02","07/08","06/07","05/06"]
[null,null,null,null,null,null,null,"2008-04-03","07/08","06/07","05/06",null,"2008-04-03","07/08","06/07","05/06"]
[null,null,null,null,null,null,null,"2008-04-04","07/08","06/07","05/06",null,"2008-04-04","07/08","06/07","05/06"]
[null,null,null,null,null,null,null,"2008-04-05","07/08","06/07","05/06",null,"2008-04-05","07/08","06/07","05/06"]
[null,null,null,null,null,null,null,"2008-04-06","08/09","07/08","05/06",null,"2008-04-06","08/09","07/08","05/06"]
[null,null,null,null,null,null,null,"2008-04-07","08/09","07/08","05/06",null,"2008-04-07","08/09","07/08","05/06"]
[null,null,null,null,null,null,null,"2008-04-08","08/09","07/08","05/06",null,"2008-04-08","08/09","07/08","05/06"]
[null,null,null,null,null,null,null,"2008-04-09","08/09","07/08","05/06",null,"2008-04-09","08/09","07/08","05/06"]
[null,null,null,null,null,null,null,"2008-04-10","08/09","07/08","05/06",null,"2008-04-10","08/09","07/08","05/06"]
[null,null,null,null,null,null,null,"2008-04-11","08/09","07/08","05/06",null,"2008-04-11","08/09","07/08","05/06"]
[null,null,null,null,null,null,null,"2008-04-12","08/09","07/08","05/06",null,"2008-04-12","08/09","07/08","05/06"]
[null,null,null,null,null,null,null,"2008-04-13","08/09","07/08","05/06",null,"2008-04-13","08/09","07/08","05/06"]
[null,null,null,null,null,null,null,"2008-04-14","08/09","07/08","05/06",null,"2008-04-14","08/09","07/08","05/06"]
[null,null,null,null,null,null,null,"2008-04-15","08/09","07/08","05/06",null,"2008-04-15","08/09","07/08","05/06"]
[null,null,null,null,null,null,null,"2008-04-16","08/09","07/08","05/06",null,"2008-04-16","08/09","07/08","05/06"]
[null,null,null,null,null,null,null,"2008-04-17","08/09","07/08","05/06",null,"2008-04-17","08/09","07/08","05/06"]
[null,null,null,null,null,null,null,"2008-04-18","08/09","07/08","05/06",null,"2008-04-18","08/09","07/08","05/06"]
[null,null,null,null,null,null,null,"2008-04-19","08/09","07/08","05/06",null,"2008-04-19","08/09","07/08","05/06"]
[null,null,null,null,null,null,null,"2008-04-20","08/09","07/08","05/06",null,"2008-04-20","08/09","07/08","05/06"]
[null,null,null,null,null,null,null,"2008-04-21","08/09","07/08","05/06",null,"2008-04-21","08/09","07/08","05/06"]
[null,null,null,null,null,null,null,"2008-04-22","08/09","07/08","05/06",null,"2008-04-22","08/09","07/08","05/06"]
[null,null,null,null,null,null,null,"2008-04-23","08/09","07/08","05/06",null,"2008-04-23","08/09","07/08","05/06"]
[null,null,null,null,null,null,null,"2008-04-24","08/09","07/08","05/06",null,"2008-04-24","08/09","07/08","05/06"]
[null,null,null,null,null,null,null,"2008-04-25","08/09","07/08","05/06",null,"2008-04-25","08/09","07/08","05/06"]
[null,null,null,null,null,null,null,"2008-04-26","08/09","07/08","05/06",null,"2008-04-26","08/09","07/08","05/06"]
[null,null,null,null,null,null,null,"2008-04-27","08/09","07/08","05/06",null,"2008-04-27","08/09","07/08","05/06"]
[null,null,null,null,null,null,null,"2008-04-28","08/09","07/08","05/06",null,"2008-04-28","08/09","07/08","05/06"]
[null,null,null,null,null,null,null,"2008-04-29","08/09","07/08","05/06",null,"2008-04-29","08/09","07/08","05/06"]
[null,null,null,null,null,null,null,"2008-04-30","08/09","07/08","05/06",null,"2008-04-30","08/09","07/08","05/06"]
[null,null,null,null,null,null,null,"2008-05-01","08/09","07/08","05/06",null,"2008-05-01","08/09","07/08","05/06"]
[null,null,null,null,null,null,null,"2008-05-02","08/09","07/08","05/06",null,"2008-05-02","08/09","07/08","05/06"]
[null,null,null,null,null,null,null,"2008-05-03","08/09","07/08","05/06",null,"2008-05-03","08/09","07/08","05/06"]
[null,null,null,null,null,null,null,"2008-05-04","08/09","07/08","05/06",null,"2008-05-04","08/09","07/08","05/06"]
[null,null,null,null,null,null,null,"2008-05-05","08/09","07/08","05/06",null,"2008-05-05","08/09","07/08","05/06"]
[null,null,null,null,null,null,null,"2008-05-06","08/09","07/08","05/06",null,"2008-05-06","08/09","07/08","05/06"]
[null,null,null,null,null,null,null,"2008-05-07","08/09","07/08","05/06",null,"2008-05-07","08/09","07/08","05/06"]
[null,null,null,null,null,null,null,"2008-05-08","08/09","07/08","05/06",null,"2008-05-08","08/09","07/08","05/06"]
[null,null,null,null,null,null,null,"2008-05-09","08/09","07/08","05/06",null,"2008-05-09","08/09","07/08","05/06"]
[null,null,null,null,null,null,null,"2008-05-10","08/09","07/08","05/06",null,"2008-05-10","08/09","07/08","05/06"]
[null,null,null,null,null,null,null,"2008-05-11","08/09","07/08","05/06",null,"2008-05-11","08/09","07/08","05/06"]
[null,null,null,null,null,null,null,"2008-05-12","08/09","07/08","05/06",null,"2008-05-12","08/09","07/08","05/06"]
[null,null,null,null,null,null,null,"2008-05-13","08/09","07/08","05/06",null,"2008-05-13","08/09","07/08","05/06"]
[null,null,null,null,null,null,null,"2008-05-14","08/09","07/08","05/06",null,"2008-05-14","08/09","07/08","05/06"]
[null,null,null,null,null,null,null,"2008-05-15","08/09","07/08","05/06",null,"2008-05-15","08/09","07/08","05/06"]
[null,null,null,null,null,null,null,"2008-05-16","08/09","07/08","05/06",null,"2008-05-16","08/09","07/08","05/06"]
[null,null,null,null,null,null,null,"2008-05-17","08/09","07/08","05/06",null,"2008-05-17","08/09","07/08","05/06"]
[null,null,null,null,null,null,null,"2008-05-18","08/09","07/08","05/06",null,"2008-05-18","08/09","07/08","05/06"]
[null,null,null,null,null,null,null,"2008-05-19","08/09","07/08","05/06",null,"2008-05-19","08/09","07/08","05/06"]
[null,null,null,null,null,null,null,"2008-05-20","08/09","07/08","05/06",null,"2008-05-20","08/09","07/08","05/06"]
[null,null,null,null,null,null,null,"2008-05-21","08/09","07/08","05/06",null,"2008-05-21","08/09","07/08","05/06"]
[null,null,null,null,null,null,null,"2008-05-22","08/09","07/08","05/06",null,"2008-05-22","08/09","07/08","05/06"]
[null,null,null,null,null,null,null,"2008-05-23","08/09","07/08","05/06",null,"2008-05-23","08/09","07/08","05/06"]
[null,null,null,null,null,null,null,"2008-05-24","08/09","07/08","05/06",null,"2008-05-24","08/09","07/08","05/06"]
[null,null,null,null,null,null,null,"2008-05-25","08/09","07/08","05/06",null,"2008-05-25","08/09","07/08","05/06"]
[null,null,null,null,null,null,null,"2008-05-26","08/09","07/08","05/06",null,"2008-05-26","08/09","07/08","05/06"]
[null,null,null,null,null,null,null,"2008-05-27","08/09","07/08","05/06",null,"2008-05-27","08/09","07/08","05/06"]
[null,null,null,null,null,null,null,"2008-05-28","08/09","07/08","05/06",null,"2008-05-28","08/09","07/08","05/06"]
[null,null,null,null,null,null,null,"2008-05-29","08/09","07/08","05/06",null,"2008-05-29","08/09","07/08","05/06"]
[null,null,null,null,null,null,null,"2008-05-30","08/09","07/08","05/06",null,"2008-05-30","08/09","07/08","05/06"]
[null,null,null,null,null,null,null,"2008-05-31","08/09","07/08","05/06",null,"2008-05-31","08/09","07/08","05/06"]
[null,null,null,null,null,null,null,"2008-06-01","08/09","07/08","05/06",null,"2008-06-01","08/09","07/08","05/06"]
[null,null,null,null,null,null,null,"2008-06-02","08/09","07/08","05/06",null,"2008-06-02","08/09","07/08","05/06"]
[null,null,null,null,null,null,null,"2008-06-03","08/09","07/08","05/06",null,"2008-06-03","08/09","07/08","05/06"]
[null,null,null,null,null,null,null,"2008-06-04","08/09","07/08","05/06",null,"2008-06-04","08/09","07/08","05/06"]
[null,null,null,null,null,null,null,"2008-06-05","08/09","07/08","05/06",null,"2008-06-05","08/09","07/08","05/06"]
[null,null,null,null,null,null,null,"2008-06-06","08/09","07/08","05/06",null,"2008-06-06","08/09","07/08","05/06"]
[null,null,null,null,null,null,null,"2008-06-07","08/09","07/08","05/06",null,"2008-06-07","08/09","07/08","05/06"]
[null,null,null,null,null,null,null,"2008-06-08","08/09","07/08","05/06",null,"2008-06-08","08/09","07/08","05/06"]
[null,null,null,null,null,null,null,"2008-06-09","08/09","07/08","05/06",null,"2008-06-09","08/09","07/08","05/06"]
[null,null,null,null,null,null,null,"2008-06-10","08/09","07/08","05/06",null,"2008-06-10","08/09","07/08","05/06"]
[null,null,null,null,null,null,null,"2008-06-11","08/09","07/08","05/06",null,"2008-06-11","08/09","07/08","05/06"]
[null,null,null,null,null,null,null,"2008-06-12","08/09","07/08","05/06",null,"2008-06-12","08/09","07/08","05/06"]
[null,null,null,null,null,null,null,"2008-06-13","08/09","07/08","05/06",null,"2008-06-13","08/09","07/08","05/06"]
[null,null,null,null,null,null,null,"2008-06-14","08/09","07/08","05/06",null,"2008-06-14","08/09","07/08","05/06"]
[null,null,null,null,null,null,null,"2008-06-15","08/09","07/08","05/06",null,"2008-06-15","08/09","07/08","05/06"]
[null,null,null,null,null,null,null,"2008-06-16","08/09","07/08","05/06",null,"2008-06-16","08/09","07/08","05/06"]
[null,null,null,null,null,null,null,"2008-06-17","08/09","07/08","05/06",null,"2008-06-17","08/09","07/08","05/06"]
[null,null,null,null,null,null,null,"2008-06-18","08/09","07/08","05/06",null,"2008-06-18","08/09","07/08","05/06"]
[null,null,null,null,null,null,null,"2008-06-19","08/09","07/08","05/06",null,"2008-06-19","08/09","07/08","05/06"]
[null,null,null,null,null,null,null,"2008-06-20","08/09","07/08","05/06",null,"2008-06-20","08/09","07/08","05/06"]
[null,null,null,null,null,null,null,"2008-06-21","08/09","07/08","05/06",null,"2008-06-21","08/09","07/08","05/06"]
[null,null,null,null,null,null,null,"2008-06-22","08/09","07/08","05/06",null,"2008-06-22","08/09","07/08","05/06"]
[null,null,null,null,null,null,null,"2008-06-23","08/09","07/08","05/06",null,"2008-06-23","08/09","07/08","05/06"]
[null,null,null,null,null,null,null,"2008-06-24","08/09","07/08","05/06",null,"2008-06-24","08/09","07/08","05/06"]
[null,null,null,null,null,null,null,"2008-06-25","08/09","07/08","05/06",null,"2008-06-25","08/09","07/08","05/06"]
[null,null,null,null,null,null,null,"2008-06-26","08/09","07/08","05/06",null,"2008-06-26","08/09","07/08","05/06"]
[null,null,null,null,null,null,null,"2008-06-27","08/09","07/08","05/06",null,"2008-06-27","08/09","07/08","05/06"]
[null,null,null,null,null,null,null,"2008-06-28","08/09","07/08","05/06",null,"2008-06-28","08/09","07/08","05/06"]
[null,null,null,null,null,null,null,"2008-06-29","08/09","07/08","05/06",null,"2008-06-29","08/09","07/08","05/06"]
[null,null,null,null,null,null,null,"2008-06-30","08/09","07/08","05/06",null,"2008-06-30","08/09","07/08","05/06"]
[null,null,null,null,null,null,null,"2008-07-01","08/09","07/08","05/06",null,"2008-07-01","08/09","07/08","05/06"]
[null,null,null,null,null,null,null,"2008-07-02","08/09","07/08","05/06",null,"2008-07-02","08/09","07/08","05/06"]
[null,null,null,null,null,null,null,"2008-07-03","08/09","07/08","05/06",null,"2008-07-03","08/09","07/08","05/06"]
[null,null,null,null,null,null,null,"2008-07-04","08/09","07/08","05/06",null,"2008-07-04","08/09","07/08","05/06"]
[null,null,null,null,null,null,null,"2008-07-05","08/09","07/08","05/06",null,"2008-07-05","08/09","07/08","05/06"]
[null,null,null,null,null,null,null,"2008-07-06","08/09","07/08","05/06",null,"2008-07-06","08/09","07/08","05/06"]
[null,null,null,null,null,null,null,"2008-07-07","08/09","07/08","05/06",null,"2008-07-07","08/09","07/08","05/06"]
[null,null,null,null,null,null,null,"2008-07-08","08/09","07/08","05/06",null,"2008-07-08","08/09","07/08","05/06"]
[null,null,null,null,null,null,null,"2008-07-09","08/09","07/08","05/06",null,"2008-07-09","08/09","07/08","05/06"]
[null,null,null,null,null,null,null,"2008-07-10","08/09","07/08","05/06",null,"2008-07-10","08/09","07/08","05/06"]
[null,null,null,null,null,null,null,"2008-07-11","08/09","07/08","05/06",null,"2008-07-11","08/09","07/08","05/06"]
[null,null,null,null,null,null,null,"2008-07-12","08/09","07/08","05/06",null,"2008-07-12","08/09","07/08","05/06"]
[null,null,null,null,null,null,null,"2008-07-13","08/09","07/08","05/06",null,"2008-07-13","08/09","07/08","05/06"]
[null,null,null,null,null,null,null,"2008-07-14","08/09","07/08","05/06",null,"2008-07-14","08/09","07/08","05/06"]
[null,null,null,null,null,null,null,"2008-07-15","08/09","07/08","05/06",null,"2008-07-15","08/09","07/08","05/06"]
[null,null,null,null,null,null,null,"2008-07-16","08/09","07/08","05/06",null,"2008-07-16","08/09","07/08","05/06"]
[null,null,null,null,null,null,null,"2008-07-17","08/09","07/08","05/06",null,"2008-07-17","08/09","07/08","05/06"]
[null,null,null,null,null,null,null,"2008-07-18","08/09","07/08","05/06",null,"2008-07-18","08/09","07/08","05/06"]
[null,null,null,null,null,null,null,"2008-07-19","08/09","07/08","05/06",null,"2008-07-19","08/09","07/08","05/06"]
[null,null,null,null,null,null,null,"2008-07-20","08/09","07/08","05/06",null,"2008-07-20","08/09","07/08","05/06"]
[null,null,null,null,null,null,null,"2008-07-21","08/09","07/08","05/06",null,"2008-07-21","08/09","07/08","05/06"]
[null,null,null,null,null,null,null,"2008-07-22","08/09","07/08","05/06",null,"2008-07-22","08/09","07/08","05/06"]
[null,null,null,null,null,null,null,"2008-07-23","08/09","07/08","05/06",null,"2008-07-23","08/09","07/08","05/06"]
[null,null,null,null,null,null,null,"2008-07-24","08/09","07/08","05/06",null,"2008-07-24","08/09","07/08","05/06"]
[null,null,null,null,null,null,null,"2008-07-25","08/09","07/08","05/06",null,"2008-07-25","08/09","07/08","05/06"]
[null,null,null,null,null,null,null,"2008-07-26","08/09","07/08","05/06",null,"2008-07-26","08/09","07/08","05/06"]
[null,null,null,null,null,null,null,"2008-07-27","08/09","07/08","05/06",null,"2008-07-27","08/09","07/08","05/06"]
[null,null,null,null,null,null,null,"2008-07-28","08/09","07/08","05/06",null,"2008-07-28","08/09","07/08","05/06"]
[null,null,null,null,null,null,null,"2008-07-29","08/09","07/08","05/06",null,"2008-07-29","08/09","07/08","05/06"]
[null,null,null,null,null,null,null,"2008-07-30","08/09","07/08","05/06",null,"2008-07-30","08/09","07/08","05/06"]
[null,null,null,null,null,null,null,"2008-07-31","08/09","07/08","05/06",null,"2008-07-31","08/09","07/08","05/06"]
[null,null,null,null,null,null,null,"2008-08-01","08/09","07/08","05/06",null,"2008-08-01","08/09","07/08","05/06"]
[null,null,null,null,null,null,null,"2008-08-02","08/09","07/08","05/06",null,"2008-08-02","08/09","07/08","05/06"]
[null,null,null,null,null,null,null,"2008-08-03","08/09","07/08","05/06",null,"2008-08-03","08/09","07/08","05/06"]
[null,null,null,null,null,null,null,"2008-08-04","08/09","07/08","05/06",null,"2008-08-04","08/09","07/08","05/06"]
[null,null,null,null,null,null,null,"2008-08-05","08/09","07/08","05/06",null,"2008-08-05","08/09","07/08","05/06"]
[null,null,null,null,null,null,null,"2008-08-06","08/09","07/08","05/06",null,"2008-08-06","08/09","07/08","05/06"]
[null,null,null,null,null,null,null,"2008-08-07","08/09","07/08","05/06",null,"2008-08-07","08/09","07/08","05/06"]
[null,null,null,null,null,null,null,"2008-08-08","08/09","07/08","05/06",null,"2008-08-08","08/09","07/08","05/06"]
[null,null,null,null,null,null,null,"2008-08-09","08/09","07/08","05/06",null,"2008-08-09","08/09","07/08","05/06"]
[null,null,null,null,null,null,null,"2008-08-10","08/09","07/08","05/06",null,"2008-08-10","08/09","07/08","05/06"]
[null,null,null,null,null,null,null,"2008-08-11","08/09","07/08","05/06",null,"2008-08-11","08/09","07/08","05/06"]
[null,null,null,null,null,null,null,"2008-08-12","08/09","07/08","05/06",null,"2008-08-12","08/09","07/08","05/06"]
[null,null,null,null,null,null,null,"2008-08-13","08/09","07/08","05/06",null,"2008-08-13","08/09","07/08","05/06"]
[null,null,null,null,null,null,null,"2008-08-14","08/09","07/08","05/06",null,"2008-08-14","08/09","07/08","05/06"]
[null,null,null,null,null,null,null,"2008-08-15","08/09","07/08","05/06",null,"2008-08-15","08/09","07/08","05/06"]
[null,null,null,null,null,null,null,"2008-08-16","08/09","07/08","05/06",null,"2008-08-16","08/09","07/08","05/06"]
[null,null,null,null,null,null,null,"2008-08-17","08/09","07/08","05/06",null,"2008-08-17","08/09","07/08","05/06"]
[null,null,null,null,null,null,null,"2008-08-18","08/09","07/08","05/06",null,"2008-08-18","08/09","07/08","05/06"]
[null,null,null,null,null,null,null,"2008-08-19","08/09","07/08","05/06",null,"2008-08-19","08/09","07/08","05/06"]
[null,null,null,null,null,null,null,"2008-08-20","08/09","07/08","05/06",null,"2008-08-20","08/09","07/08","05/06"]
[null,null,null,null,null,null,null,"2008-08-21","08/09","07/08","05/06",null,"2008-08-21","08/09","07/08","05/06"]
[null,null,null,null,null,null,null,"2008-08-22","08/09","07/08","05/06",null,"2008-08-22","08/09","07/08","05/06"]
[null,null,null,null,null,null,null,"2008-08-23","08/09","07/08","05/06",null,"2008-08-23","08/09","07/08","05/06"]
[null,null,null,null,null,null,null,"2008-08-24","08/09","07/08","05/06",null,"2008-08-24","08/09","07/08","05/06"]
[null,null,null,null,null,null,null,"2008-08-25","08/09","07/08","05/06",null,"2008-08-25","08/09","07/08","05/06"]
[null,null,null,null,null,null,null,"2008-08-26","08/09","07/08","05/06",null,"2008-08-26","08/09","07/08","05/06"]
[null,null,null,null,null,null,null,"2008-08-27","08/09","07/08","05/06",null,"2008-08-27","08/09","07/08","05/06"]
[null,null,null,null,null,null,null,"2008-08-28","08/09","07/08","05/06",null,"2008-08-28","08/09","07/08","05/06"]
[null,null,null,null,null,null,null,"2008-08-29","08/09","07/08","05/06",null,"2008-08-29","08/09","07/08","05/06"]
[null,null,null,null,null,null,null,"2008-08-30","08/09","07/08","05/06",null,"2008-08-30","08/09","07/08","05/06"]
[null,null,null,null,null,null,null,"2008-08-31","08/09","07/08","05/06",null,"2008-08-31","08/09","07/08","05/06"]
[null,null,null,null,null,null,null,"2008-09-01","08/09","07/08","05/06",null,"2008-09-01","08/09","07/08","05/06"]
[null,null,null,null,null,null,null,"2008-09-02","08/09","07/08","05/06",null,"2008-09-02","08/09","07/08","05/06"]
[null,null,null,null,null,null,null,"2008-09-03","08/09","07/08","05/06",null,"2008-09-03","08/09","07/08","05/06"]
[null,null,null,null,null,null,null,"2008-09-04","08/09","07/08","05/06",null,"2008-09-04","08/09","07/08","05/06"]
[null,null,null,null,null,null,null,"2008-09-05","08/09","07/08","05/06",null,"2008-09-05","08/09","07/08","05/06"]
[null,null,null,null,null,null,null,"2008-09-06","08/09","07/08","05/06",null,"2008-09-06","08/09","07/08","05/06"]
[null,null,null,null,null,null,null,"2008-09-07","08/09","07/08","05/06",null,"2008-09-07","08/09","07/08","05/06"]
[null,null,null,null,null,null,null,"2008-09-08","08/09","07/08","05/06",null,"2008-09-08","08/09","07/08","05/06"]
[null,null,null,null,null,null,null,"2008-09-09","08/09","07/08","05/06",null,"2008-09-09","08/09","07/08","05/06"]
[null,null,null,null,null,null,null,"2008-09-10","08/09","07/08","05/06",null,"2008-09-10","08/09","07/08","05/06"]
[null,null,null,null,null,null,null,"2008-09-11","08/09","07/08","05/06",null,"2008-09-11","08/09","07/08","05/06"]
[null,null,null,null,null,null,null,"2008-09-12","08/09","07/08","05/06",null,"2008-09-12","08/09","07/08","05/06"]
[null,null,null,null,null,null,null,"2008-09-13","08/09","07/08","05/06",null,"2008-09-13","08/09","07/08","05/06"]
[null,null,null,null,null,null,null,"2008-09-14","08/09","07/08","05/06",null,"2008-09-14","08/09","07/08","05/06"]
[null,null,null,null,null,null,null,"2008-09-15","08/09","07/08","05/06",null,"2008-09-15","08/09","07/08","05/06"]
[null,null,null,null,null,null,null,"2008-09-16","08/09","07/08","05/06",null,"2008-09-16","08/09","07/08","05/06"]
[null,null,null,null,null,null,null,"2008-09-17","08/09","07/08","05/06",null,"2008-09-17","08/09","07/08","05/06"]
[null,null,null,null,null,null,null,"2008-09-18","08/09","07/08","05/06",null,"2008-09-18","08/09","07/08","05/06"]
[null,null,null,null,null,null,null,"2008-09-19","08/09","07/08","05/06",null,"2008-09-19","08/09","07/08","05/06"]
[null,null,null,null,null,null,null,"2008-09-20","08/09","07/08","05/06",null,"2008-09-20","08/09","07/08","05/06"]
[null,null,null,null,null,null,null,"2008-09-21","08/09","07/08","05/06",null,"2008-09-21","08/09","07/08","05/06"]
[null,null,null,null,null,null,null,"2008-09-22","08/09","07/08","05/06",null,"2008-09-22","08/09","07/08","05/06"]
[null,null,null,null,null,null,null,"2008-09-23","08/09","07/08","05/06",null,"2008-09-23","08/09","07/08","05/06"]
[null,null,null,null,null,null,null,"2008-09-24","08/09","07/08","05/06",null,"2008-09-24","08/09","07/08","05/06"]
[null,null,null,null,null,null,null,"2008-09-25","08/09","07/08","05/06",null,"2008-09-25","08/09","07/08","05/06"]
[null,null,null,null,null,null,null,"2008-09-26","08/09","07/08","05/06",null,"2008-09-26","08/09","07/08","05/06"]
[null,null,null,null,null,null,null,"2008-09-27","08/09","07/08","05/06",null,"2008-09-27","08/09","07/08","05/06"]
[null,null,null,null,null,null,null,"2008-09-28","08/09","07/08","05/06",null,"2008-09-28","08/09","07/08","05/06"]
[null,null,null,null,null,null,null,"2008-09-29","08/09","07/08","05/06",null,"2008-09-29","08/09","07/08","05/06"]
[null,null,null,null,null,null,null,"2008-09-30","08/09","07/08","05/06",null,"2008-09-30","08/09","07/08","05/06"]
[null,null,null,null,null,null,null,"2008-10-01","08/09","07/08","05/06",null,"2008-10-01","08/09","07/08","05/06"]
[null,null,null,null,null,null,null,"2008-10-02","08/09","07/08","05/06",null,"2008-10-02","08/09","07/08","05/06"]
[null,null,null,null,null,null,null,"2008-10-03","08/09","07/08","05/06",null,"2008-10-03","08/09","07/08","05/06"]
[null,null,null,null,null,null,null,"2008-10-04","08/09","07/08","05/06",null,"2008-10-04","08/09","07/08","05/06"]
[null,null,null,null,null,null,null,"2008-10-05","08/09","07/08","05/06",null,"2008-10-05","08/09","07/08","05/06"]
[null,null,null,null,null,null,null,"2008-10-06","08/09","07/08","05/06",null,"2008-10-06","08/09","07/08","05/06"]
[null,null,null,null,null,null,null,"2008-10-07","08/09","07/08","05/06",null,"2008-10-07","08/09","07/08","05/06"]
[null,null,null,null,null,null,null,"2008-10-08","08/09","07/08","05/06",null,"2008-10-08","08/09","07/08","05/06"]
[null,null,null,null,null,null,null,"2008-10-09","08/09","07/08","05/06",null,"2008-10-09","08/09","07/08","05/06"]
[null,null,null,null,null,null,null,"2008-10-10","08/09","07/08","05/06",null,"2008-10-10","08/09","07/08","05/06"]
[null,null,null,null,null,null,null,"2008-10-11","08/09","07/08","05/06",null,"2008-10-11","08/09","07/08","05/06"]
[null,null,null,null,null,null,null,"2008-10-12","08/09","07/08","05/06",null,"2008-10-12","08/09","07/08","05/06"]
[null,null,null,null,null,null,null,"2008-10-13","08/09","07/08","05/06",null,"2008-10-13","08/09","07/08","05/06"]
[null,null,null,null,null,null,null,"2008-10-14","08/09","07/08","05/06",null,"2008-10-14","08/09","07/08","05/06"]
[null,null,null,null,null,null,null,"2008-10-15","08/09","07/08","05/06",null,"2008-10-15","08/09","07/08","05/06"]
[null,null,null,null,null,null,null,"2008-10-16","08/09","07/08","05/06",null,"2008-10-16","08/09","07/08","05/06"]
[null,null,null,null,null,null,null,"2008-10-17","08/09","07/08","05/06",null,"2008-10-17","08/09","07/08","05/06"]
[null,null,null,null,null,null,null,"2008-10-18","08/09","07/08","05/06",null,"2008-10-18","08/09","07/08","05/06"]
[null,null,null,null,null,null,null,"2008-10-19","08/09","07/08","05/06",null,"2008-10-19","08/09","07/08","05/06"]
[null,null,null,null,null,null,null,"2008-10-20","08/09","07/08","05/06",null,"2008-10-20","08/09","07/08","05/06"]
[null,null,null,null,null,null,null,"2008-10-21","08/09","07/08","05/06",null,"2008-10-21","08/09","07/08","05/06"]
[null,null,null,null,null,null,null,"2008-10-22","08/09","07/08","05/06",null,"2008-10-22","08/09","07/08","05/06"]
[null,null,null,null,null,null,null,"2008-10-23","08/09","07/08","05/06",null,"2008-10-23","08/09","07/08","05/06"]
[null,null,null,null,null,null,null,"2008-10-24","08/09","07/08","05/06",null,"2008-10-24","08/09","07/08","05/06"]
[null,null,null,null,null,null,null,"2008-10-25","08/09","07/08","05/06",null,"2008-10-25","08/09","07/08","05/06"]
[null,null,null,null,null,null,null,"2008-10-26","08/09","07/08","05/06",null,"2008-10-26","08/09","07/08","05/06"]
[null,null,null,null,null,null,null,"2008-10-27","08/09","07/08","05/06",null,"2008-10-27","08/09","07/08","05/06"]
[null,null,null,null,null,null,null,"2008-10-28","08/09","07/08","05/06",null,"2008-10-28","08/09","07/08","05/06"]
[null,null,null,null,null,null,null,"2008-10-29","08/09","07/08","05/06",null,"2008-10-29","08/09","07/08","05/06"]
[null,null,null,null,null,null,null,"2008-10-30","08/09","07/08","05/06",null,"2008-10-30","08/09","07/08","05/06"]
[null,null,null,null,null,null,null,"2008-10-31","08/09","07/08","05/06",null,"2008-10-31","08/09","07/08","05/06"]
[null,null,null,null,null,null,null,"2008-11-01","08/09","07/08","05/06",null,"2008-11-01","08/09","07/08","05/06"]
[null,null,null,null,null,null,null,"2008-11-02","08/09","07/08","05/06",null,"2008-11-02","08/09","07/08","05/06"]
[null,null,null,null,null,null,null,"2008-11-03","08/09","07/08","05/06",null,"2008-11-03","08/09","07/08","05/06"]
[null,null,null,null,null,null,null,"2008-11-04","08/09","07/08","05/06",null,"2008-11-04","08/09","07/08","05/06"]
[null,null,null,null,null,null,null,"2008-11-05","08/09","07/08","05/06",null,"2008-11-05","08/09","07/08","05/06"]
[null,null,null,null,null,null,null,"2008-11-06","08/09","07/08","05/06",null,"2008-11-06","08/09","07/08","05/06"]
[null,null,null,null,null,null,null,"2008-11-07","08/09","07/08","05/06",null,"2008-11-07","08/09","07/08","05/06"]
[null,null,null,null,null,null,null,"2008-11-08","08/09","07/08","05/06",null,"2008-11-08","08/09","07/08","05/06"]
[null,null,null,null,null,null,null,"2008-11-09","08/09","07/08","05/06",null,"2008-11-09","08/09","07/08","05/06"]
[null,null,null,null,null,null,null,"2008-11-10","08/09","07/08","05/06",null,"2008-11-10","08/09","07/08","05/06"]
[null,null,null,null,null,null,null,"2008-11-11","08/09","07/08","05/06",null,"2008-11-11","08/09","07/08","05/06"]
[null,null,null,null,null,null,null,"2008-11-12","08/09","07/08","05/06",null,"2008-11-12","08/09","07/08","05/06"]
[null,null,null,null,null,null,null,"2008-11-13","08/09","07/08","05/06",null,"2008-11-13","08/09","07/08","05/06"]
[null,null,null,null,null,null,null,"2008-11-14","08/09","07/08","05/06",null,"2008-11-14","08/09","07/08","05/06"]
[null,null,null,null,null,null,null,"2008-11-15","08/09","07/08","05/06",null,"2008-11-15","08/09","07/08","05/06"]
[null,null,null,null,null,null,null,"2008-11-16","08/09","07/08","05/06",null,"2008-11-16","08/09","07/08","05/06"]
[null,null,null,null,null,null,null,"2008-11-17","08/09","07/08","05/06",null,"2008-11-17","08/09","07/08","05/06"]
[null,null,null,null,null,null,null,"2008-11-18","08/09","07/08","05/06",null,"2008-11-18","08/09","07/08","05/06"]
[null,null,null,null,null,null,null,"2008-11-19","08/09","07/08","05/06",null,"2008-11-19","08/09","07/08","05/06"]
[null,null,null,null,null,null,null,"2008-11-20","08/09","07/08","05/06",null,"2008-11-20","08/09","07/08","05/06"]
[null,null,null,null,null,null,null,"2008-11-21","08/09","07/08","05/06",null,"2008-11-21","08/09","07/08","05/06"]
[null,null,null,null,null,null,null,"2008-11-22","08/09","07/08","05/06",null,"2008-11-22","08/09","07/08","05/06"]
[null,null,null,null,null,null,null,"2008-11-23","08/09","07/08","05/06",null,"2008-11-23","08/09","07/08","05/06"]
[null,null,null,null,null,null,null,"2008-11-24","08/09","07/08","05/06",null,"2008-11-24","08/09","07/08","05/06"]
[null,null,null,null,null,null,null,"2008-11-25","08/09","07/08","05/06",null,"2008-11-25","08/09","07/08","05/06"]
[null,null,null,null,null,null,null,"2008-11-26","08/09","07/08","05/06",null,"2008-11-26","08/09","07/08","05/06"]
[null,null,null,null,null,null,null,"2008-11-27","08/09","07/08","05/06",null,"2008-11-27","08/09","07/08","05/06"]
[null,null,null,null,null,null,null,"2008-11-28","08/09","07/08","05/06",null,"2008-11-28","08/09","07/08","05/06"]
[null,null,null,null,null,null,null,"2008-11-29","08/09","07/08","05/06",null,"2008-11-29","08/09","07/08","05/06"]
[null,null,null,null,null,null,null,"2008-11-30","08/09","07/08","05/06",null,"2008-11-30","08/09","07/08","05/06"]
[null,null,null,null,null,null,null,"2008-12-01","08/09","07/08","05/06",null,"2008-12-01","08/09","07/08","05/06"]
[null,null,null,null,null,null,null,"2008-12-02","08/09","07/08","05/06",null,"2008-12-02","08/09","07/08","05/06"]
[null,null,null,null,null,null,null,"2008-12-03","08/09","07/08","05/06",null,"2008-12-03","08/09","07/08","05/06"]
[null,null,null,null,null,null,null,"2008-12-04","08/09","07/08","05/06",null,"2008-12-04","08/09","07/08","05/06"]
[null,null,null,null,null,null,null,"2008-12-05","08/09","07/08","05/06",null,"2008-12-05","08/09","07/08","05/06"]
[null,null,null,null,null,null,null,"2008-12-06","08/09","07/08","05/06",null,"2008-12-06","08/09","07/08","05/06"]
[null,null,null,null,null,null,null,"2008-12-07","08/09","07/08","05/06",null,"2008-12-07","08/09","07/08","05/06"]
[null,null,null,null,null,null,null,"2008-12-08","08/09","07/08","05/06",null,"2008-12-08","08/09","07/08","05/06"]
[null,null,null,null,null,null,null,"2008-12-09","08/09","07/08","05/06",null,"2008-12-09","08/09","07/08","05/06"]
[null,null,null,null,null,null,null,"2008-12-10","08/09","07/08","05/06",null,"2008-12-10","08/09","07/08","05/06"]
[null,null,null,null,null,null,null,"2008-12-11","08/09","07/08","05/06",null,"2008-12-11","08/09","07/08","05/06"]
[null,null,null,null,null,null,null,"2008-12-12","08/09","07/08","05/06",null,"2008-12-12","08/09","07/08","05/06"]
[null,null,null,null,null,null,null,"2008-12-13","08/09","07/08","05/06",null,"2008-12-13","08/09","07/08","05/06"]
[null,null,null,null,null,null,null,"2008-12-14","08/09","07/08","05/06",null,"2008-12-14","08/09","07/08","05/06"]
[null,null,null,null,null,null,null,"2008-12-15","08/09","07/08","05/06",null,"2008-12-15","08/09","07/08","05/06"]
[null,null,null,null,null,null,null,"2008-12-16","08/09","07/08","05/06",null,"2008-12-16","08/09","07/08","05/06"]
[null,null,null,null,null,null,null,"2008-12-17","08/09","07/08","05/06",null,"2008-12-17","08/09","07/08","05/06"]
[null,null,null,null,null,null,null,"2008-12-18","08/09","07/08","05/06",null,"2008-12-18","08/09","07/08","05/06"]
[null,null,null,null,null,null,null,"2008-12-19","08/09","07/08","05/06",null,"2008-12-19","08/09","07/08","05/06"]
[null,null,null,null,null,null,null,"2008-12-20","08/09","07/08","05/06",null,"2008-12-20","08/09","07/08","05/06"]
[null,null,null,null,null,null,null,"2008-12-21","08/09","07/08","05/06",null,"2008-12-21","08/09","07/08","05/06"]
[null,null,null,null,null,null,null,"2008-12-22","08/09","07/08","05/06",null,"2008-12-22","08/09","07/08","05/06"]
[null,null,null,null,null,null,null,"2008-12-23","08/09","07/08","05/06",null,"2008-12-23","08/09","07/08","05/06"]
[null,null,null,null,null,null,null,"2008-12-24","08/09","07/08","05/06",null,"2008-12-24","08/09","07/08","05/06"]
[null,null,null,null,null,null,null,"2008-12-25","08/09","07/08","05/06",null,"2008-12-25","08/09","07/08","05/06"]
[null,null,null,null,null,null,null,"2008-12-26","08/09","07/08","05/06",null,"2008-12-26","08/09","07/08","05/06"]
[null,null,null,null,null,null,null,"2008-12-27","08/09","07/08","05/06",null,"2008-12-27","08/09","07/08","05/06"]
[null,null,null,null,null,null,null,"2008-12-28","08/09","07/08","05/06",null,"2008-12-28","08/09","07/08","05/06"]
[null,null,null,null,null,null,null,"2008-12-29","08/09","07/08","05/06",null,"2008-12-29","08/09","07/08","05/06"]
[null,null,null,null,null,null,null,"2008-12-30","08/09","07/08","05/06",null,"2008-12-30","08/09","07/08","05/06"]
[null,null,null,null,null,null,null,"2008-12-31","08/09","07/08","05/06",null,"2008-12-31","08/09","07/08","05/06"]
[null,null,null,null,null,null,null,"2009-01-01","08/09","07/08","05/06",null,"2009-01-01","08/09","07/08","05/06"]
[null,null,null,null,null,null,null,"2009-01-02","08/09","07/08","05/06",null,"2009-01-02","08/09","07/08","05/06"]
[null,null,null,null,null,null,null,"2009-01-03","08/09","07/08","05/06",null,"2009-01-03","08/09","07/08","05/06"]
[null,null,null,null,null,null,null,"2009-01-04","08/09","07/08","05/06",null,"2009-01-04","08/09","07/08","05/06"]
[null,null,null,null,null,null,null,"2009-01-05","08/09","07/08","05/06",null,"2009-01-05","08/09","07/08","05/06"]
[null,null,null,null,null,null,null,"2009-01-06","08/09","07/08","05/06",null,"2009-01-06","08/09","07/08","05/06"]
[null,null,null,null,null,null,null,"2009-01-07","08/09","07/08","05/06",null,"2009-01-07","08/09","07/08","05/06"]
[null,null,null,null,null,null,null,"2009-01-08","08/09","07/08","05/06",null,"2009-01-08","08/09","07/08","05/06"]
[null,null,null,null,null,null,null,"2009-01-09","08/09","07/08","05/06",null,"2009-01-09","08/09","07/08","05/06"]
[null,null,null,null,null,null,null,"2009-01-10","08/09","07/08","05/06",null,"2009-01-10","08/09","07/08","05/06"]
[null,null,null,null,null,null,null,"2009-01-11","08/09","07/08","05/06",null,"2009-01-11","08/09","07/08","05/06"]
[null,null,null,null,null,null,null,"2009-01-12","08/09","07/08","05/06",null,"2009-01-12","08/09","07/08","05/06"]
[null,null,null,null,null,null,null,"2009-01-13","08/09","07/08","05/06",null,"2009-01-13","08/09","07/08","05/06"]
[null,null,null,null,null,null,null,"2009-01-14","08/09","07/08","05/06",null,"2009-01-14","08/09","07/08","05/06"]
[null,null,null,null,null,null,null,"2009-01-15","08/09","07/08","05/06",null,"2009-01-15","08/09","07/08","05/06"]
[null,null,null,null,null,null,null,"2009-01-16","08/09","07/08","05/06",null,"2009-01-16","08/09","07/08","05/06"]
[null,null,null,null,null,null,null,"2009-01-17","08/09","07/08","05/06",null,"2009-01-17","08/09","07/08","05/06"]
[null,null,null,null,null,null,null,"2009-01-18","08/09","07/08","05/06",null,"2009-01-18","08/09","07/08","05/06"]
[null,null,null,null,null,null,null,"2009-01-19","08/09","07/08","05/06",null,"2009-01-19","08/09","07/08","05/06"]
[null,null,null,null,null,null,null,"2009-01-20","08/09","07/08","05/06",null,"2009-01-20","08/09","07/08","05/06"]
[null,null,null,null,null,null,null,"2009-01-21","08/09","07/08","05/06",null,"2009-01-21","08/09","07/08","05/06"]
[null,null,null,null,null,null,null,"2009-01-22","08/09","07/08","05/06",null,"2009-01-22","08/09","07/08","05/06"]
[null,null,null,null,null,null,null,"2009-01-23","08/09","07/08","05/06",null,"2009-01-23","08/09","07/08","05/06"]
[null,null,null,null,null,null,null,"2009-01-24","08/09","07/08","05/06",null,"2009-01-24","08/09","07/08","05/06"]
[null,null,null,null,null,null,null,"2009-01-25","08/09","07/08","05/06",null,"2009-01-25","08/09","07/08","05/06"]
[null,null,null,null,null,null,null,"2009-01-26","08/09","07/08","05/06",null,"2009-01-26","08/09","07/08","05/06"]
[null,null,null,null,null,null,null,"2009-01-27","08/09","07/08","05/06",null,"2009-01-27","08/09","07/08","05/06"]
[null,null,null,null,null,null,null,"2009-01-28","08/09","07/08","05/06",null,"2009-01-28","08/09","07/08","05/06"]
[null,null,null,null,null,null,null,"2009-01-29","08/09","07/08","05/06",null,"2009-01-29","08/09","07/08","05/06"]
[null,null,null,null,null,null,null,"2009-01-30","08/09","07/08","05/06",null,"2009-01-30","08/09","07/08","05/06"]
[null,null,null,null,null,null,null,"2009-01-31","08/09","07/08","05/06",null,"2009-01-31","08/09","07/08","05/06"]
[null,null,null,null,null,null,null,"2009-02-01","08/09","07/08","05/06",null,"2009-02-01","08/09","07/08","05/06"]
[null,null,null,null,null,null,null,"2009-02-02","08/09","07/08","05/06",null,"2009-02-02","08/09","07/08","05/06"]
[null,null,null,null,null,null,null,"2009-02-03","08/09","07/08","05/06",null,"2009-02-03","08/09","07/08","05/06"]
[null,null,null,null,null,null,null,"2009-02-04","08/09","07/08","05/06",null,"2009-02-04","08/09","07/08","05/06"]
[null,null,null,null,null,null,null,"2009-02-05","08/09","07/08","05/06",null,"2009-02-05","08/09","07/08","05/06"]
[null,null,null,null,null,null,null,"2009-02-06","08/09","07/08","05/06",null,"2009-02-06","08/09","07/08","05/06"]
[null,null,null,null,null,null,null,"2009-02-07","08/09","07/08","05/06",null,"2009-02-07","08/09","07/08","05/06"]
[null,null,null,null,null,null,null,"2009-02-08","08/09","07/08","05/06",null,"2009-02-08","08/09","07/08","05/06"]
[null,null,null,null,null,null,null,"2009-02-09","08/09","07/08","05/06",null,"2009-02-09","08/09","07/08","05/06"]
[null,null,null,null,null,null,null,"2009-02-10","08/09","07/08","05/06",null,"2009-02-10","08/09","07/08","05/06"]
[null,null,null,null,null,null,null,"2009-02-11","08/09","07/08","05/06",null,"2009-02-11","08/09","07/08","05/06"]
[null,null,null,null,null,null,null,"2009-02-12","08/09","07/08","05/06",null,"2009-02-12","08/09","07/08","05/06"]
[null,null,null,null,null,null,null,"2009-02-13","08/09","07/08","05/06",null,"2009-02-13","08/09","07/08","05/06"]
[null,null,null,null,null,null,null,"2009-02-14","08/09","07/08","05/06",null,"2009-02-14","08/09","07/08","05/06"]
[null,null,null,null,null,null,null,"2009-02-15","08/09","07/08","05/06",null,"2009-02-15","08/09","07/08","05/06"]
[null,null,null,null,null,null,null,"2009-02-16","08/09","07/08","05/06",null,"2009-02-16","08/09","07/08","05/06"]
[null,null,null,null,null,null,null,"2009-02-17","08/09","07/08","05/06",null,"2009-02-17","08/09","07/08","05/06"]
[null,null,null,null,null,null,null,"2009-02-18","08/09","07/08","05/06",null,"2009-02-18","08/09","07/08","05/06"]
[null,null,null,null,null,null,null,"2009-02-19","08/09","07/08","05/06",null,"2009-02-19","08/09","07/08","05/06"]
[null,null,null,null,null,null,null,"2009-02-20","08/09","07/08","05/06",null,"2009-02-20","08/09","07/08","05/06"]
[null,null,null,null,null,null,null,"2009-02-21","08/09","07/08","05/06",null,"2009-02-21","08/09","07/08","05/06"]
[null,null,null,null,null,null,null,"2009-02-22","08/09","07/08","05/06",null,"2009-02-22","08/09","07/08","05/06"]
[null,null,null,null,null,null,null,"2009-02-23","08/09","07/08","05/06",null,"2009-02-23","08/09","07/08","05/06"]
[null,null,null,null,null,null,null,"2009-02-24","08/09","07/08","05/06",null,"2009-02-24","08/09","07/08","05/06"]
[null,null,null,null,null,null,null,"2009-02-25","08/09","07/08","05/06",null,"2009-02-25","08/09","07/08","05/06"]
[null,null,null,null,null,null,null,"2009-02-26","08/09","07/08","05/06",null,"2009-02-26","08/09","07/08","05/06"]
[null,null,null,null,null,null,null,"2009-02-27","08/09","07/08","05/06",null,"2009-02-27","08/09","07/08","05/06"]
[null,null,null,null,null,null,null,"2009-02-28","08/09","07/08","05/06",null,"2009-02-28","08/09","07/08","05/06"]
[null,null,null,null,null,null,null,"2009-03-01","08/09","07/08","05/06",null,"2009-03-01","08/09","07/08","05/06"]
[null,null,null,null,null,null,null,"2009-03-02","08/09","07/08","05/06",null,"2009-03-02","08/09","07/08","05/06"]
[null,null,null,null,null,null,null,"2009-03-03","08/09","07/08","05/06",null,"2009-03-03","08/09","07/08","05/06"]
[null,null,null,null,null,null,null,"2009-03-04","08/09","07/08","05/06",null,"2009-03-04","08/09","07/08","05/06"]
[null,null,null,null,null,null,null,"2009-03-05","08/09","07/08","05/06",null,"2009-03-05","08/09","07/08","05/06"]
[null,null,null,null,null,null,null,"2009-03-06","08/09","07/08","05/06",null,"2009-03-06","08/09","07/08","05/06"]
[null,null,null,null,null,null,null,"2009-03-07","08/09","07/08","05/06",null,"2009-03-07","08/09","07/08","05/06"]
[null,null,null,null,null,null,null,"2009-03-08","08/09","07/08","05/06",null,"2009-03-08","08/09","07/08","05/06"]
[null,null,null,null,null,null,null,"2009-03-09","08/09","07/08","05/06",null,"2009-03-09","08/09","07/08","05/06"]
[null,null,null,null,null,null,null,"2009-03-10","08/09","07/08","05/06",null,"2009-03-10","08/09","07/08","05/06"]
[null,null,null,null,null,null,null,"2009-03-11","08/09","07/08","05/06",null,"2009-03-11","08/09","07/08","05/06"]
[null,null,null,null,null,null,null,"2009-03-12","08/09","07/08","05/06",null,"2009-03-12","08/09","07/08","05/06"]
[null,null,null,null,null,null,null,"2009-03-13","08/09","07/08","05/06",null,"2009-03-13","08/09","07/08","05/06"]
[null,null,null,null,null,null,null,"2009-03-14","08/09","07/08","05/06",null,"2009-03-14","08/09","07/08","05/06"]
[null,null,null,null,null,null,null,"2009-03-15","08/09","07/08","05/06",null,"2009-03-15","08/09","07/08","05/06"]
[null,null,null,null,null,null,null,"2009-03-16","08/09","07/08","05/06",null,"2009-03-16","08/09","07/08","05/06"]
[null,null,null,null,null,null,null,"2009-03-17","08/09","07/08","05/06",null,"2009-03-17","08/09","07/08","05/06"]
[null,null,null,null,null,null,null,"2009-03-18","08/09","07/08","05/06",null,"2009-03-18","08/09","07/08","05/06"]
[null,null,null,null,null,null,null,"2009-03-19","08/09","07/08","05/06",null,"2009-03-19","08/09","07/08","05/06"]
[null,null,null,null,null,null,null,"2009-03-20","08/09","07/08","05/06",null,"2009-03-20","08/09","07/08","05/06"]
[null,null,null,null,null,null,null,"2009-03-21","08/09","07/08","05/06",null,"2009-03-21","08/09","07/08","05/06"]
[null,null,null,null,null,null,null,"2009-03-22","08/09","07/08","05/06",null,"2009-03-22","08/09","07/08","05/06"]
[null,null,null,null,null,null,null,"2009-03-23","08/09","07/08","05/06",null,"2009-03-23","08/09","07/08","05/06"]
[null,null,null,null,null,null,null,"2009-03-24","08/09","07/08","05/06",null,"2009-03-24","08/09","07/08","05/06"]
[null,null,null,null,null,null,null,"2009-03-25","08/09","07/08","05/06",null,"2009-03-25","08/09","07/08","05/06"]
[null,null,null,null,null,null,null,"2009-03-26","08/09","07/08","05/06",null,"2009-03-26","08/09","07/08","05/06"]
[null,null,null,null,null,null,null,"2009-03-27","08/09","07/08","05/06",null,"2009-03-27","08/09","07/08","05/06"]
[null,null,null,null,null,null,null,"2009-03-28","08/09","07/08","05/06",null,"2009-03-28","08/09","07/08","05/06"]
[null,null,null,null,null,null,null,"2009-03-29","08/09","07/08","05/06",null,"2009-03-29","08/09","07/08","05/06"]
[null,null,null,null,null,null,null,"2009-03-30","08/09","07/08","05/06",null,"2009-03-30","08/09","07/08","05/06"]
[null,null,null,null,null,null,null,"2009-03-31","08/09","07/08","05/06",null,"2009-03-31","08/09","07/08","05/06"]
[null,null,null,null,null,null,null,"2009-04-01","08/09","07/08","05/06",null,"2009-04-01","08/09","07/08","05/06"]
[null,null,null,null,null,null,null,"2009-04-02","08/09","07/08","05/06",null,"2009-04-02","08/09","07/08","05/06"]
[null,null,null,null,null,null,null,"2009-04-03","08/09","07/08","05/06",null,"2009-04-03","08/09","07/08","05/06"]
[null,null,null,null,null,null,null,"2009-04-04","08/09","07/08","05/06",null,"2009-04-04","08/09","07/08","05/06"]
[null,null,null,null,null,null,null,"2009-04-05","08/09","07/08","05/06",null,"2009-04-05","08/09","07/08","05/06"]
[null,null,null,null,null,null,null,"2009-04-06","09/10","08/09","07/08",null,"2009-04-06","09/10","08/09","07/08"]
[null,null,null,null,null,null,null,"2009-04-07","09/10","08/09","07/08",null,"2009-04-07","09/10","08/09","07/08"]
[null,null,null,null,null,null,null,"2009-04-08","09/10","08/09","07/08",null,"2009-04-08","09/10","08/09","07/08"]
[null,null,null,null,null,null,null,"2009-04-09","09/10","08/09","07/08",null,"2009-04-09","09/10","08/09","07/08"]
[null,null,null,null,null,null,null,"2009-04-10","09/10","08/09","07/08",null,"2009-04-10","09/10","08/09","07/08"]
[null,null,null,null,null,null,null,"2009-04-11","09/10","08/09","07/08",null,"2009-04-11","09/10","08/09","07/08"]
[null,null,null,null,null,null,null,"2009-04-12","09/10","08/09","07/08",null,"2009-04-12","09/10","08/09","07/08"]
[null,null,null,null,null,null,null,"2009-04-13","09/10","08/09","07/08",null,"2009-04-13","09/10","08/09","07/08"]
[null,null,null,null,null,null,null,"2009-04-14","09/10","08/09","07/08",null,"2009-04-14","09/10","08/09","07/08"]
[null,null,null,null,null,null,null,"2009-04-15","09/10","08/09","07/08",null,"2009-04-15","09/10","08/09","07/08"]
[null,null,null,null,null,null,null,"2009-04-16","09/10","08/09","07/08",null,"2009-04-16","09/10","08/09","07/08"]
[null,null,null,null,null,null,null,"2009-04-17","09/10","08/09","07/08",null,"2009-04-17","09/10","08/09","07/08"]
[null,null,null,null,null,null,null,"2009-04-18","09/10","08/09","07/08",null,"2009-04-18","09/10","08/09","07/08"]
[null,null,null,null,null,null,null,"2009-04-19","09/10","08/09","07/08",null,"2009-04-19","09/10","08/09","07/08"]
[null,null,null,null,null,null,null,"2009-04-20","09/10","08/09","07/08",null,"2009-04-20","09/10","08/09","07/08"]
[null,null,null,null,null,null,null,"2009-04-21","09/10","08/09","07/08",null,"2009-04-21","09/10","08/09","07/08"]
[null,null,null,null,null,null,null,"2009-04-22","09/10","08/09","07/08",null,"2009-04-22","09/10","08/09","07/08"]
[null,null,null,null,null,null,null,"2009-04-23","09/10","08/09","07/08",null,"2009-04-23","09/10","08/09","07/08"]
[null,null,null,null,null,null,null,"2009-04-24","09/10","08/09","07/08",null,"2009-04-24","09/10","08/09","07/08"]
[null,null,null,null,null,null,null,"2009-04-25","09/10","08/09","07/08",null,"2009-04-25","09/10","08/09","07/08"]
[null,null,null,null,null,null,null,"2009-04-26","09/10","08/09","07/08",null,"2009-04-26","09/10","08/09","07/08"]
[null,null,null,null,null,null,null,"2009-04-27","09/10","08/09","07/08",null,"2009-04-27","09/10","08/09","07/08"]
[null,null,null,null,null,null,null,"2009-04-28","09/10","08/09","07/08",null,"2009-04-28","09/10","08/09","07/08"]
[null,null,null,null,null,null,null,"2009-04-29","09/10","08/09","07/08",null,"2009-04-29","09/10","08/09","07/08"]
[null,null,null,null,null,null,null,"2009-04-30","09/10","08/09","07/08",null,"2009-04-30","09/10","08/09","07/08"]
[null,null,null,null,null,null,null,"2009-05-01","09/10","08/09","07/08",null,"2009-05-01","09/10","08/09","07/08"]
[null,null,null,null,null,null,null,"2009-05-02","09/10","08/09","07/08",null,"2009-05-02","09/10","08/09","07/08"]
[null,null,null,null,null,null,null,"2009-05-03","09/10","08/09","07/08",null,"2009-05-03","09/10","08/09","07/08"]
[null,null,null,null,null,null,null,"2009-05-04","09/10","08/09","07/08",null,"2009-05-04","09/10","08/09","07/08"]
[null,null,null,null,null,null,null,"2009-05-05","09/10","08/09","07/08",null,"2009-05-05","09/10","08/09","07/08"]
[null,null,null,null,null,null,null,"2009-05-06","09/10","08/09","07/08",null,"2009-05-06","09/10","08/09","07/08"]
[null,null,null,null,null,null,null,"2009-05-07","09/10","08/09","07/08",null,"2009-05-07","09/10","08/09","07/08"]
[null,null,null,null,null,null,null,"2009-05-08","09/10","08/09","07/08",null,"2009-05-08","09/10","08/09","07/08"]
[null,null,null,null,null,null,null,"2009-05-09","09/10","08/09","07/08",null,"2009-05-09","09/10","08/09","07/08"]
[null,null,null,null,null,null,null,"2009-05-10","09/10","08/09","07/08",null,"2009-05-10","09/10","08/09","07/08"]
[null,null,null,null,null,null,null,"2009-05-11","09/10","08/09","07/08",null,"2009-05-11","09/10","08/09","07/08"]
[null,null,null,null,null,null,null,"2009-05-12","09/10","08/09","07/08",null,"2009-05-12","09/10","08/09","07/08"]
[null,null,null,null,null,null,null,"2009-05-13","09/10","08/09","07/08",null,"2009-05-13","09/10","08/09","07/08"]
[null,null,null,null,null,null,null,"2009-05-14","09/10","08/09","07/08",null,"2009-05-14","09/10","08/09","07/08"]
[null,null,null,null,null,null,null,"2009-05-15","09/10","08/09","07/08",null,"2009-05-15","09/10","08/09","07/08"]
[null,null,null,null,null,null,null,"2009-05-16","09/10","08/09","07/08",null,"2009-05-16","09/10","08/09","07/08"]
[null,null,null,null,null,null,null,"2009-05-17","09/10","08/09","07/08",null,"2009-05-17","09/10","08/09","07/08"]
[null,null,null,null,null,null,null,"2009-05-18","09/10","08/09","07/08",null,"2009-05-18","09/10","08/09","07/08"]
[null,null,null,null,null,null,null,"2009-05-19","09/10","08/09","07/08",null,"2009-05-19","09/10","08/09","07/08"]
[null,null,null,null,null,null,null,"2009-05-20","09/10","08/09","07/08",null,"2009-05-20","09/10","08/09","07/08"]
[null,null,null,null,null,null,null,"2009-05-21","09/10","08/09","07/08",null,"2009-05-21","09/10","08/09","07/08"]
[null,null,null,null,null,null,null,"2009-05-22","09/10","08/09","07/08",null,"2009-05-22","09/10","08/09","07/08"]
[null,null,null,null,null,null,null,"2009-05-23","09/10","08/09","07/08",null,"2009-05-23","09/10","08/09","07/08"]
[null,null,null,null,null,null,null,"2009-05-24","09/10","08/09","07/08",null,"2009-05-24","09/10","08/09","07/08"]
[null,null,null,null,null,null,null,"2009-05-25","09/10","08/09","07/08",null,"2009-05-25","09/10","08/09","07/08"]
[null,null,null,null,null,null,null,"2009-05-26","09/10","08/09","07/08",null,"2009-05-26","09/10","08/09","07/08"]
[null,null,null,null,null,null,null,"2009-05-27","09/10","08/09","07/08",null,"2009-05-27","09/10","08/09","07/08"]
[null,null,null,null,null,null,null,"2009-05-28","09/10","08/09","07/08",null,"2009-05-28","09/10","08/09","07/08"]
[null,null,null,null,null,null,null,"2009-05-29","09/10","08/09","07/08",null,"2009-05-29","09/10","08/09","07/08"]
[null,null,null,null,null,null,null,"2009-05-30","09/10","08/09","07/08",null,"2009-05-30","09/10","08/09","07/08"]
[null,null,null,null,null,null,null,"2009-05-31","09/10","08/09","07/08",null,"2009-05-31","09/10","08/09","07/08"]
[null,null,null,null,null,null,null,"2009-06-01","09/10","08/09","07/08",null,"2009-06-01","09/10","08/09","07/08"]
[null,null,null,null,null,null,null,"2009-06-02","09/10","08/09","07/08",null,"2009-06-02","09/10","08/09","07/08"]
[null,null,null,null,null,null,null,"2009-06-03","09/10","08/09","07/08",null,"2009-06-03","09/10","08/09","07/08"]
[null,null,null,null,null,null,null,"2009-06-04","09/10","08/09","07/08",null,"2009-06-04","09/10","08/09","07/08"]
[null,null,null,null,null,null,null,"2009-06-05","09/10","08/09","07/08",null,"2009-06-05","09/10","08/09","07/08"]
[null,null,null,null,null,null,null,"2009-06-06","09/10","08/09","07/08",null,"2009-06-06","09/10","08/09","07/08"]
[null,null,null,null,null,null,null,"2009-06-07","09/10","08/09","07/08",null,"2009-06-07","09/10","08/09","07/08"]
[null,null,null,null,null,null,null,"2009-06-08","09/10","08/09","07/08",null,"2009-06-08","09/10","08/09","07/08"]
[null,null,null,null,null,null,null,"2009-06-09","09/10","08/09","07/08",null,"2009-06-09","09/10","08/09","07/08"]
[null,null,null,null,null,null,null,"2009-06-10","09/10","08/09","07/08",null,"2009-06-10","09/10","08/09","07/08"]
[null,null,null,null,null,null,null,"2009-06-11","09/10","08/09","07/08",null,"2009-06-11","09/10","08/09","07/08"]
[null,null,null,null,null,null,null,"2009-06-12","09/10","08/09","07/08",null,"2009-06-12","09/10","08/09","07/08"]
[null,null,null,null,null,null,null,"2009-06-13","09/10","08/09","07/08",null,"2009-06-13","09/10","08/09","07/08"]
[null,null,null,null,null,null,null,"2009-06-14","09/10","08/09","07/08",null,"2009-06-14","09/10","08/09","07/08"]
[null,null,null,null,null,null,null,"2009-06-15","09/10","08/09","07/08",null,"2009-06-15","09/10","08/09","07/08"]
[null,null,null,null,null,null,null,"2009-06-16","09/10","08/09","07/08",null,"2009-06-16","09/10","08/09","07/08"]
[null,null,null,null,null,null,null,"2009-06-17","09/10","08/09","07/08",null,"2009-06-17","09/10","08/09","07/08"]
[null,null,null,null,null,null,null,"2009-06-18","09/10","08/09","07/08",null,"2009-06-18","09/10","08/09","07/08"]
[null,null,null,null,null,null,null,"2009-06-19","09/10","08/09","07/08",null,"2009-06-19","09/10","08/09","07/08"]
[null,null,null,null,null,null,null,"2009-06-20","09/10","08/09","07/08",null,"2009-06-20","09/10","08/09","07/08"]
[null,null,null,null,null,null,null,"2009-06-21","09/10","08/09","07/08",null,"2009-06-21","09/10","08/09","07/08"]
[null,null,null,null,null,null,null,"2009-06-22","09/10","08/09","07/08",null,"2009-06-22","09/10","08/09","07/08"]
[null,null,null,null,null,null,null,"2009-06-23","09/10","08/09","07/08",null,"2009-06-23","09/10","08/09","07/08"]
[null,null,null,null,null,null,null,"2009-06-24","09/10","08/09","07/08",null,"2009-06-24","09/10","08/09","07/08"]
[null,null,null,null,null,null,null,"2009-06-25","09/10","08/09","07/08",null,"2009-06-25","09/10","08/09","07/08"]
[null,null,null,null,null,null,null,"2009-06-26","09/10","08/09","07/08",null,"2009-06-26","09/10","08/09","07/08"]
[null,null,null,null,null,null,null,"2009-06-27","09/10","08/09","07/08",null,"2009-06-27","09/10","08/09","07/08"]
[null,null,null,null,null,null,null,"2009-06-28","09/10","08/09","07/08",null,"2009-06-28","09/10","08/09","07/08"]
[null,null,null,null,null,null,null,"2009-06-29","09/10","08/09","07/08",null,"2009-06-29","09/10","08/09","07/08"]
[null,null,null,null,null,null,null,"2009-06-30","09/10","08/09","07/08",null,"2009-06-30","09/10","08/09","07/08"]
[null,null,null,null,null,null,null,"2009-07-01","09/10","08/09","07/08",null,"2009-07-01","09/10","08/09","07/08"]
[null,null,null,null,null,null,null,"2009-07-02","09/10","08/09","07/08",null,"2009-07-02","09/10","08/09","07/08"]
[null,null,null,null,null,null,null,"2009-07-03","09/10","08/09","07/08",null,"2009-07-03","09/10","08/09","07/08"]
[null,null,null,null,null,null,null,"2009-07-04","09/10","08/09","07/08",null,"2009-07-04","09/10","08/09","07/08"]
[null,null,null,null,null,null,null,"2009-07-05","09/10","08/09","07/08",null,"2009-07-05","09/10","08/09","07/08"]
[null,null,null,null,null,null,null,"2009-07-06","09/10","08/09","07/08",null,"2009-07-06","09/10","08/09","07/08"]
[null,null,null,null,null,null,null,"2009-07-07","09/10","08/09","07/08",null,"2009-07-07","09/10","08/09","07/08"]
[null,null,null,null,null,null,null,"2009-07-08","09/10","08/09","07/08",null,"2009-07-08","09/10","08/09","07/08"]
[null,null,null,null,null,null,null,"2009-07-09","09/10","08/09","07/08",null,"2009-07-09","09/10","08/09","07/08"]
[null,null,null,null,null,null,null,"2009-07-10","09/10","08/09","07/08",null,"2009-07-10","09/10","08/09","07/08"]
[null,null,null,null,null,null,null,"2009-07-11","09/10","08/09","07/08",null,"2009-07-11","09/10","08/09","07/08"]
[null,null,null,null,null,null,null,"2009-07-12","09/10","08/09","07/08",null,"2009-07-12","09/10","08/09","07/08"]
[null,null,null,null,null,null,null,"2009-07-13","09/10","08/09","07/08",null,"2009-07-13","09/10","08/09","07/08"]
[null,null,null,null,null,null,null,"2009-07-14","09/10","08/09","07/08",null,"2009-07-14","09/10","08/09","07/08"]
[null,null,null,null,null,null,null,"2009-07-15","09/10","08/09","07/08",null,"2009-07-15","09/10","08/09","07/08"]
[null,null,null,null,null,null,null,"2009-07-16","09/10","08/09","07/08",null,"2009-07-16","09/10","08/09","07/08"]
[null,null,null,null,null,null,null,"2009-07-17","09/10","08/09","07/08",null,"2009-07-17","09/10","08/09","07/08"]
[null,null,null,null,null,null,null,"2009-07-18","09/10","08/09","07/08",null,"2009-07-18","09/10","08/09","07/08"]
[null,null,null,null,null,null,null,"2009-07-19","09/10","08/09","07/08",null,"2009-07-19","09/10","08/09","07/08"]
[null,null,null,null,null,null,null,"2009-07-20","09/10","08/09","07/08",null,"2009-07-20","09/10","08/09","07/08"]
[null,null,null,null,null,null,null,"2009-07-21","09/10","08/09","07/08",null,"2009-07-21","09/10","08/09","07/08"]
[null,null,null,null,null,null,null,"2009-07-22","09/10","08/09","07/08",null,"2009-07-22","09/10","08/09","07/08"]
[null,null,null,null,null,null,null,"2009-07-23","09/10","08/09","07/08",null,"2009-07-23","09/10","08/09","07/08"]
[null,null,null,null,null,null,null,"2009-07-24","09/10","08/09","07/08",null,"2009-07-24","09/10","08/09","07/08"]
[null,null,null,null,null,null,null,"2009-07-25","09/10","08/09","07/08",null,"2009-07-25","09/10","08/09","07/08"]
[null,null,null,null,null,null,null,"2009-07-26","09/10","08/09","07/08",null,"2009-07-26","09/10","08/09","07/08"]
[null,null,null,null,null,null,null,"2009-07-27","09/10","08/09","07/08",null,"2009-07-27","09/10","08/09","07/08"]
[null,null,null,null,null,null,null,"2009-07-28","09/10","08/09","07/08",null,"2009-07-28","09/10","08/09","07/08"]
[null,null,null,null,null,null,null,"2009-07-29","09/10","08/09","07/08",null,"2009-07-29","09/10","08/09","07/08"]
[null,null,null,null,null,null,null,"2009-07-30","09/10","08/09","07/08",null,"2009-07-30","09/10","08/09","07/08"]
[null,null,null,null,null,null,null,"2009-07-31","09/10","08/09","07/08",null,"2009-07-31","09/10","08/09","07/08"]
[null,null,null,null,null,null,null,"2009-08-01","09/10","08/09","07/08",null,"2009-08-01","09/10","08/09","07/08"]
[null,null,null,null,null,null,null,"2009-08-02","09/10","08/09","07/08",null,"2009-08-02","09/10","08/09","07/08"]
[null,null,null,null,null,null,null,"2009-08-03","09/10","08/09","07/08",null,"2009-08-03","09/10","08/09","07/08"]
[null,null,null,null,null,null,null,"2009-08-04","09/10","08/09","07/08",null,"2009-08-04","09/10","08/09","07/08"]
[null,null,null,null,null,null,null,"2009-08-05","09/10","08/09","07/08",null,"2009-08-05","09/10","08/09","07/08"]
[null,null,null,null,null,null,null,"2009-08-06","09/10","08/09","07/08",null,"2009-08-06","09/10","08/09","07/08"]
[null,null,null,null,null,null,null,"2009-08-07","09/10","08/09","07/08",null,"2009-08-07","09/10","08/09","07/08"]
[null,null,null,null,null,null,null,"2009-08-08","09/10","08/09","07/08",null,"2009-08-08","09/10","08/09","07/08"]
[null,null,null,null,null,null,null,"2009-08-09","09/10","08/09","07/08",null,"2009-08-09","09/10","08/09","07/08"]
[null,null,null,null,null,null,null,"2009-08-10","09/10","08/09","07/08",null,"2009-08-10","09/10","08/09","07/08"]
[null,null,null,null,null,null,null,"2009-08-11","09/10","08/09","07/08",null,"2009-08-11","09/10","08/09","07/08"]
[null,null,null,null,null,null,null,"2009-08-12","09/10","08/09","07/08",null,"2009-08-12","09/10","08/09","07/08"]
[null,null,null,null,null,null,null,"2009-08-13","09/10","08/09","07/08",null,"2009-08-13","09/10","08/09","07/08"]
[null,null,null,null,null,null,null,"2009-08-14","09/10","08/09","07/08",null,"2009-08-14","09/10","08/09","07/08"]
[null,null,null,null,null,null,null,"2009-08-15","09/10","08/09","07/08",null,"2009-08-15","09/10","08/09","07/08"]
[null,null,null,null,null,null,null,"2009-08-16","09/10","08/09","07/08",null,"2009-08-16","09/10","08/09","07/08"]
[null,null,null,null,null,null,null,"2009-08-17","09/10","08/09","07/08",null,"2009-08-17","09/10","08/09","07/08"]
[null,null,null,null,null,null,null,"2009-08-18","09/10","08/09","07/08",null,"2009-08-18","09/10","08/09","07/08"]
[null,null,null,null,null,null,null,"2009-08-19","09/10","08/09","07/08",null,"2009-08-19","09/10","08/09","07/08"]
[null,null,null,null,null,null,null,"2009-08-20","09/10","08/09","07/08",null,"2009-08-20","09/10","08/09","07/08"]
[null,null,null,null,null,null,null,"2009-08-21","09/10","08/09","07/08",null,"2009-08-21","09/10","08/09","07/08"]
[null,null,null,null,null,null,null,"2009-08-22","09/10","08/09","07/08",null,"2009-08-22","09/10","08/09","07/08"]
[null,null,null,null,null,null,null,"2009-08-23","09/10","08/09","07/08",null,"2009-08-23","09/10","08/09","07/08"]
[null,null,null,null,null,null,null,"2009-08-24","09/10","08/09","07/08",null,"2009-08-24","09/10","08/09","07/08"]
[null,null,null,null,null,null,null,"2009-08-25","09/10","08/09","07/08",null,"2009-08-25","09/10","08/09","07/08"]
[null,null,null,null,null,null,null,"2009-08-26","09/10","08/09","07/08",null,"2009-08-26","09/10","08/09","07/08"]
[null,null,null,null,null,null,null,"2009-08-27","09/10","08/09","07/08",null,"2009-08-27","09/10","08/09","07/08"]
[null,null,null,null,null,null,null,"2009-08-28","09/10","08/09","07/08",null,"2009-08-28","09/10","08/09","07/08"]
[null,null,null,null,null,null,null,"2009-08-29","09/10","08/09","07/08",null,"2009-08-29","09/10","08/09","07/08"]
[null,null,null,null,null,null,null,"2009-08-30","09/10","08/09","07/08",null,"2009-08-30","09/10","08/09","07/08"]
[null,null,null,null,null,null,null,"2009-08-31","09/10","08/09","07/08",null,"2009-08-31","09/10","08/09","07/08"]
[null,null,null,null,null,null,null,"2009-09-01","09/10","08/09","07/08",null,"2009-09-01","09/10","08/09","07/08"]
[null,null,null,null,null,null,null,"2009-09-02","09/10","08/09","07/08",null,"2009-09-02","09/10","08/09","07/08"]
[null,null,null,null,null,null,null,"2009-09-03","09/10","08/09","07/08",null,"2009-09-03","09/10","08/09","07/08"]
[null,null,null,null,null,null,null,"2009-09-04","09/10","08/09","07/08",null,"2009-09-04","09/10","08/09","07/08"]
[null,null,null,null,null,null,null,"2009-09-05","09/10","08/09","07/08",null,"2009-09-05","09/10","08/09","07/08"]
[null,null,null,null,null,null,null,"2009-09-06","09/10","08/09","07/08",null,"2009-09-06","09/10","08/09","07/08"]
[null,null,null,null,null,null,null,"2009-09-07","09/10","08/09","07/08",null,"2009-09-07","09/10","08/09","07/08"]
[null,null,null,null,null,null,null,"2009-09-08","09/10","08/09","07/08",null,"2009-09-08","09/10","08/09","07/08"]
[null,null,null,null,null,null,null,"2009-09-09","09/10","08/09","07/08",null,"2009-09-09","09/10","08/09","07/08"]
[null,null,null,null,null,null,null,"2009-09-10","09/10","08/09","07/08",null,"2009-09-10","09/10","08/09","07/08"]
[null,null,null,null,null,null,null,"2009-09-11","09/10","08/09","07/08",null,"2009-09-11","09/10","08/09","07/08"]
[null,null,null,null,null,null,null,"2009-09-12","09/10","08/09","07/08",null,"2009-09-12","09/10","08/09","07/08"]
[null,null,null,null,null,null,null,"2009-09-13","09/10","08/09","07/08",null,"2009-09-13","09/10","08/09","07/08"]
[null,null,null,null,null,null,null,"2009-09-14","09/10","08/09","07/08",null,"2009-09-14","09/10","08/09","07/08"]
[null,null,null,null,null,null,null,"2009-09-15","09/10","08/09","07/08",null,"2009-09-15","09/10","08/09","07/08"]
[null,null,null,null,null,null,null,"2009-09-16","09/10","08/09","07/08",null,"2009-09-16","09/10","08/09","07/08"]
[null,null,null,null,null,null,null,"2009-09-17","09/10","08/09","07/08",null,"2009-09-17","09/10","08/09","07/08"]
[null,null,null,null,null,null,null,"2009-09-18","09/10","08/09","07/08",null,"2009-09-18","09/10","08/09","07/08"]
[null,null,null,null,null,null,null,"2009-09-19","09/10","08/09","07/08",null,"2009-09-19","09/10","08/09","07/08"]
[null,null,null,null,null,null,null,"2009-09-20","09/10","08/09","07/08",null,"2009-09-20","09/10","08/09","07/08"]
[null,null,null,null,null,null,null,"2009-09-21","09/10","08/09","07/08",null,"2009-09-21","09/10","08/09","07/08"]
[null,null,null,null,null,null,null,"2009-09-22","09/10","08/09","07/08",null,"2009-09-22","09/10","08/09","07/08"]
[null,null,null,null,null,null,null,"2009-09-23","09/10","08/09","07/08",null,"2009-09-23","09/10","08/09","07/08"]
[null,null,null,null,null,null,null,"2009-09-24","09/10","08/09","07/08",null,"2009-09-24","09/10","08/09","07/08"]
[null,null,null,null,null,null,null,"2009-09-25","09/10","08/09","07/08",null,"2009-09-25","09/10","08/09","07/08"]
[null,null,null,null,null,null,null,"2009-09-26","09/10","08/09","07/08",null,"2009-09-26","09/10","08/09","07/08"]
[null,null,null,null,null,null,null,"2009-09-27","09/10","08/09","07/08",null,"2009-09-27","09/10","08/09","07/08"]
[null,null,null,null,null,null,null,"2009-09-28","09/10","08/09","07/08",null,"2009-09-28","09/10","08/09","07/08"]
[null,null,null,null,null,null,null,"2009-09-29","09/10","08/09","07/08",null,"2009-09-29","09/10","08/09","07/08"]
[null,null,null,null,null,null,null,"2009-09-30","09/10","08/09","07/08",null,"2009-09-30","09/10","08/09","07/08"]
[null,null,null,null,null,null,null,"2009-10-01","09/10","08/09","07/08",null,"2009-10-01","09/10","08/09","07/08"]
[null,null,null,null,null,null,null,"2009-10-02","09/10","08/09","07/08",null,"2009-10-02","09/10","08/09","07/08"]
[null,null,null,null,null,null,null,"2009-10-03","09/10","08/09","07/08",null,"2009-10-03","09/10","08/09","07/08"]
[null,null,null,null,null,null,null,"2009-10-04","09/10","08/09","07/08",null,"2009-10-04","09/10","08/09","07/08"]
[null,null,null,null,null,null,null,"2009-10-05","09/10","08/09","07/08",null,"2009-10-05","09/10","08/09","07/08"]
[null,null,null,null,null,null,null,"2009-10-06","09/10","08/09","07/08",null,"2009-10-06","09/10","08/09","07/08"]
[null,null,null,null,null,null,null,"2009-10-07","09/10","08/09","07/08",null,"2009-10-07","09/10","08/09","07/08"]
[null,null,null,null,null,null,null,"2009-10-08","09/10","08/09","07/08",null,"2009-10-08","09/10","08/09","07/08"]
[null,null,null,null,null,null,null,"2009-10-09","09/10","08/09","07/08",null,"2009-10-09","09/10","08/09","07/08"]
[null,null,null,null,null,null,null,"2009-10-10","09/10","08/09","07/08",null,"2009-10-10","09/10","08/09","07/08"]
[null,null,null,null,null,null,null,"2009-10-11","09/10","08/09","07/08",null,"2009-10-11","09/10","08/09","07/08"]
[null,null,null,null,null,null,null,"2009-10-12","09/10","08/09","07/08",null,"2009-10-12","09/10","08/09","07/08"]
[null,null,null,null,null,null,null,"2009-10-13","09/10","08/09","07/08",null,"2009-10-13","09/10","08/09","07/08"]
[null,null,null,null,null,null,null,"2009-10-14","09/10","08/09","07/08",null,"2009-10-14","09/10","08/09","07/08"]
[null,null,null,null,null,null,null,"2009-10-15","09/10","08/09","07/08",null,"2009-10-15","09/10","08/09","07/08"]
[null,null,null,null,null,null,null,"2009-10-16","09/10","08/09","07/08",null,"2009-10-16","09/10","08/09","07/08"]
[null,null,null,null,null,null,null,"2009-10-17","09/10","08/09","07/08",null,"2009-10-17","09/10","08/09","07/08"]
[null,null,null,null,null,null,null,"2009-10-18","09/10","08/09","07/08",null,"2009-10-18","09/10","08/09","07/08"]
[null,null,null,null,null,null,null,"2009-10-19","09/10","08/09","07/08",null,"2009-10-19","09/10","08/09","07/08"]
[null,null,null,null,null,null,null,"2009-10-20","09/10","08/09","07/08",null,"2009-10-20","09/10","08/09","07/08"]
[null,null,null,null,null,null,null,"2009-10-21","09/10","08/09","07/08",null,"2009-10-21","09/10","08/09","07/08"]
[null,null,null,null,null,null,null,"2009-10-22","09/10","08/09","07/08",null,"2009-10-22","09/10","08/09","07/08"]
[null,null,null,null,null,null,null,"2009-10-23","09/10","08/09","07/08",null,"2009-10-23","09/10","08/09","07/08"]
[null,null,null,null,null,null,null,"2009-10-24","09/10","08/09","07/08",null,"2009-10-24","09/10","08/09","07/08"]
[null,null,null,null,null,null,null,"2009-10-25","09/10","08/09","07/08",null,"2009-10-25","09/10","08/09","07/08"]
[null,null,null,null,null,null,null,"2009-10-26","09/10","08/09","07/08",null,"2009-10-26","09/10","08/09","07/08"]
[null,null,null,null,null,null,null,"2009-10-27","09/10","08/09","07/08",null,"2009-10-27","09/10","08/09","07/08"]
[null,null,null,null,null,null,null,"2009-10-28","09/10","08/09","07/08",null,"2009-10-28","09/10","08/09","07/08"]
[null,null,null,null,null,null,null,"2009-10-29","09/10","08/09","07/08",null,"2009-10-29","09/10","08/09","07/08"]
[null,null,null,null,null,null,null,"2009-10-30","09/10","08/09","07/08",null,"2009-10-30","09/10","08/09","07/08"]
[null,null,null,null,null,null,null,"2009-10-31","09/10","08/09","07/08",null,"2009-10-31","09/10","08/09","07/08"]
[null,null,null,null,null,null,null,"2009-11-01","09/10","08/09","07/08",null,"2009-11-01","09/10","08/09","07/08"]
[null,null,null,null,null,null,null,"2009-11-02","09/10","08/09","07/08",null,"2009-11-02","09/10","08/09","07/08"]
[null,null,null,null,null,null,null,"2009-11-03","09/10","08/09","07/08",null,"2009-11-03","09/10","08/09","07/08"]
[null,null,null,null,null,null,null,"2009-11-04","09/10","08/09","07/08",null,"2009-11-04","09/10","08/09","07/08"]
[null,null,null,null,null,null,null,"2009-11-05","09/10","08/09","07/08",null,"2009-11-05","09/10","08/09","07/08"]
[null,null,null,null,null,null,null,"2009-11-06","09/10","08/09","07/08",null,"2009-11-06","09/10","08/09","07/08"]
[null,null,null,null,null,null,null,"2009-11-07","09/10","08/09","07/08",null,"2009-11-07","09/10","08/09","07/08"]
[null,null,null,null,null,null,null,"2009-11-08","09/10","08/09","07/08",null,"2009-11-08","09/10","08/09","07/08"]
[null,null,null,null,null,null,null,"2009-11-09","09/10","08/09","07/08",null,"2009-11-09","09/10","08/09","07/08"]
[null,null,null,null,null,null,null,"2009-11-10","09/10","08/09","07/08",null,"2009-11-10","09/10","08/09","07/08"]
[null,null,null,null,null,null,null,"2009-11-11","09/10","08/09","07/08",null,"2009-11-11","09/10","08/09","07/08"]
[null,null,null,null,null,null,null,"2009-11-12","09/10","08/09","07/08",null,"2009-11-12","09/10","08/09","07/08"]
[null,null,null,null,null,null,null,"2009-11-13","09/10","08/09","07/08",null,"2009-11-13","09/10","08/09","07/08"]
[null,null,null,null,null,null,null,"2009-11-14","09/10","08/09","07/08",null,"2009-11-14","09/10","08/09","07/08"]
[null,null,null,null,null,null,null,"2009-11-15","09/10","08/09","07/08",null,"2009-11-15","09/10","08/09","07/08"]
[null,null,null,null,null,null,null,"2009-11-16","09/10","08/09","07/08",null,"2009-11-16","09/10","08/09","07/08"]
[null,null,null,null,null,null,null,"2009-11-17","09/10","08/09","07/08",null,"2009-11-17","09/10","08/09","07/08"]
[null,null,null,null,null,null,null,"2009-11-18","09/10","08/09","07/08",null,"2009-11-18","09/10","08/09","07/08"]
[null,null,null,null,null,null,null,"2009-11-19","09/10","08/09","07/08",null,"2009-11-19","09/10","08/09","07/08"]
[null,null,null,null,null,null,null,"2009-11-20","09/10","08/09","07/08",null,"2009-11-20","09/10","08/09","07/08"]
[null,null,null,null,null,null,null,"2009-11-21","09/10","08/09","07/08",null,"2009-11-21","09/10","08/09","07/08"]
[null,null,null,null,null,null,null,"2009-11-22","09/10","08/09","07/08",null,"2009-11-22","09/10","08/09","07/08"]
[null,null,null,null,null,null,null,"2009-11-23","09/10","08/09","07/08",null,"2009-11-23","09/10","08/09","07/08"]
[null,null,null,null,null,null,null,"2009-11-24","09/10","08/09","07/08",null,"2009-11-24","09/10","08/09","07/08"]
[null,null,null,null,null,null,null,"2009-11-25","09/10","08/09","07/08",null,"2009-11-25","09/10","08/09","07/08"]
[null,null,null,null,null,null,null,"2009-11-26","09/10","08/09","07/08",null,"2009-11-26","09/10","08/09","07/08"]
[null,null,null,null,null,null,null,"2009-11-27","09/10","08/09","07/08",null,"2009-11-27","09/10","08/09","07/08"]
[null,null,null,null,null,null,null,"2009-11-28","09/10","08/09","07/08",null,"2009-11-28","09/10","08/09","07/08"]
[null,null,null,null,null,null,null,"2009-11-29","09/10","08/09","07/08",null,"2009-11-29","09/10","08/09","07/08"]
[null,null,null,null,null,null,null,"2009-11-30","09/10","08/09","07/08",null,"2009-11-30","09/10","08/09","07/08"]
[null,null,null,null,null,null,null,"2009-12-01","09/10","08/09","07/08",null,"2009-12-01","09/10","08/09","07/08"]
[null,null,null,null,null,null,null,"2009-12-02","09/10","08/09","07/08",null,"2009-12-02","09/10","08/09","07/08"]
[null,null,null,null,null,null,null,"2009-12-03","09/10","08/09","07/08",null,"2009-12-03","09/10","08/09","07/08"]
[null,null,null,null,null,null,null,"2009-12-04","09/10","08/09","07/08",null,"2009-12-04","09/10","08/09","07/08"]
[null,null,null,null,null,null,null,"2009-12-05","09/10","08/09","07/08",null,"2009-12-05","09/10","08/09","07/08"]
[null,null,null,null,null,null,null,"2009-12-06","09/10","08/09","07/08",null,"2009-12-06","09/10","08/09","07/08"]
[null,null,null,null,null,null,null,"2009-12-07","09/10","08/09","07/08",null,"2009-12-07","09/10","08/09","07/08"]
[null,null,null,null,null,null,null,"2009-12-08","09/10","08/09","07/08",null,"2009-12-08","09/10","08/09","07/08"]
[null,null,null,null,null,null,null,"2009-12-09","09/10","08/09","07/08",null,"2009-12-09","09/10","08/09","07/08"]
[null,null,null,null,null,null,null,"2009-12-10","09/10","08/09","07/08",null,"2009-12-10","09/10","08/09","07/08"]
[null,null,null,null,null,null,null,"2009-12-11","09/10","08/09","07/08",null,"2009-12-11","09/10","08/09","07/08"]
[null,null,null,null,null,null,null,"2009-12-12","09/10","08/09","07/08",null,"2009-12-12","09/10","08/09","07/08"]
[null,null,null,null,null,null,null,"2009-12-13","09/10","08/09","07/08",null,"2009-12-13","09/10","08/09","07/08"]
[null,null,null,null,null,null,null,"2009-12-14","09/10","08/09","07/08",null,"2009-12-14","09/10","08/09","07/08"]
[null,null,null,null,null,null,null,"2009-12-15","09/10","08/09","07/08",null,"2009-12-15","09/10","08/09","07/08"]
[null,null,null,null,null,null,null,"2009-12-16","09/10","08/09","07/08",null,"2009-12-16","09/10","08/09","07/08"]
[null,null,null,null,null,null,null,"2009-12-17","09/10","08/09","07/08",null,"2009-12-17","09/10","08/09","07/08"]
[null,null,null,null,null,null,null,"2009-12-18","09/10","08/09","07/08",null,"2009-12-18","09/10","08/09","07/08"]
[null,null,null,null,null,null,null,"2009-12-19","09/10","08/09","07/08",null,"2009-12-19","09/10","08/09","07/08"]
[null,null,null,null,null,null,null,"2009-12-20","09/10","08/09","07/08",null,"2009-12-20","09/10","08/09","07/08"]
[null,null,null,null,null,null,null,"2009-12-21","09/10","08/09","07/08",null,"2009-12-21","09/10","08/09","07/08"]
[null,null,null,null,null,null,null,"2009-12-22","09/10","08/09","07/08",null,"2009-12-22","09/10","08/09","07/08"]
[null,null,null,null,null,null,null,"2009-12-23","09/10","08/09","07/08",null,"2009-12-23","09/10","08/09","07/08"]
[null,null,null,null,null,null,null,"2009-12-24","09/10","08/09","07/08",null,"2009-12-24","09/10","08/09","07/08"]
[null,null,null,null,null,null,null,"2009-12-25","09/10","08/09","07/08",null,"2009-12-25","09/10","08/09","07/08"]
[null,null,null,null,null,null,null,"2009-12-26","09/10","08/09","07/08",null,"2009-12-26","09/10","08/09","07/08"]
[null,null,null,null,null,null,null,"2009-12-27","09/10","08/09","07/08",null,"2009-12-27","09/10","08/09","07/08"]
[null,null,null,null,null,null,null,"2009-12-28","09/10","08/09","07/08",null,"2009-12-28","09/10","08/09","07/08"]
[null,null,null,null,null,null,null,"2009-12-29","09/10","08/09","07/08",null,"2009-12-29","09/10","08/09","07/08"]
[null,null,null,null,null,null,null,"2009-12-30","09/10","08/09","07/08",null,"2009-12-30","09/10","08/09","07/08"]
[null,null,null,null,null,null,null,"2009-12-31","09/10","08/09","07/08",null,"2009-12-31","09/10","08/09","07/08"]
[null,null,null,null,null,null,null,"2010-01-01","09/10","08/09","07/08",null,"2010-01-01","09/10","08/09","07/08"]
[null,null,null,null,null,null,null,"2010-01-02","09/10","08/09","07/08",null,"2010-01-02","09/10","08/09","07/08"]
[null,null,null,null,null,null,null,"2010-01-03","09/10","08/09","07/08",null,"2010-01-03","09/10","08/09","07/08"]
[null,null,null,null,null,null,null,"2010-01-04","09/10","08/09","07/08",null,"2010-01-04","09/10","08/09","07/08"]
[null,null,null,null,null,null,null,"2010-01-05","09/10","08/09","07/08",null,"2010-01-05","09/10","08/09","07/08"]
[null,null,null,null,null,null,null,"2010-01-06","09/10","08/09","07/08",null,"2010-01-06","09/10","08/09","07/08"]
[null,null,null,null,null,null,null,"2010-01-07","09/10","08/09","07/08",null,"2010-01-07","09/10","08/09","07/08"]
[null,null,null,null,null,null,null,"2010-01-08","09/10","08/09","07/08",null,"2010-01-08","09/10","08/09","07/08"]
[null,null,null,null,null,null,null,"2010-01-09","09/10","08/09","07/08",null,"2010-01-09","09/10","08/09","07/08"]
[null,null,null,null,null,null,null,"2010-01-10","09/10","08/09","07/08",null,"2010-01-10","09/10","08/09","07/08"]
[null,null,null,null,null,null,null,"2010-01-11","09/10","08/09","07/08",null,"2010-01-11","09/10","08/09","07/08"]
[null,null,null,null,null,null,null,"2010-01-12","09/10","08/09","07/08",null,"2010-01-12","09/10","08/09","07/08"]
[null,null,null,null,null,null,null,"2010-01-13","09/10","08/09","07/08",null,"2010-01-13","09/10","08/09","07/08"]
[null,null,null,null,null,null,null,"2010-01-14","09/10","08/09","07/08",null,"2010-01-14","09/10","08/09","07/08"]
[null,null,null,null,null,null,null,"2010-01-15","09/10","08/09","07/08",null,"2010-01-15","09/10","08/09","07/08"]
[null,null,null,null,null,null,null,"2010-01-16","09/10","08/09","07/08",null,"2010-01-16","09/10","08/09","07/08"]
[null,null,null,null,null,null,null,"2010-01-17","09/10","08/09","07/08",null,"2010-01-17","09/10","08/09","07/08"]
[null,null,null,null,null,null,null,"2010-01-18","09/10","08/09","07/08",null,"2010-01-18","09/10","08/09","07/08"]
[null,null,null,null,null,null,null,"2010-01-19","09/10","08/09","07/08",null,"2010-01-19","09/10","08/09","07/08"]
[null,null,null,null,null,null,null,"2010-01-20","09/10","08/09","07/08",null,"2010-01-20","09/10","08/09","07/08"]
[null,null,null,null,null,null,null,"2010-01-21","09/10","08/09","07/08",null,"2010-01-21","09/10","08/09","07/08"]
[null,null,null,null,null,null,null,"2010-01-22","09/10","08/09","07/08",null,"2010-01-22","09/10","08/09","07/08"]
[null,null,null,null,null,null,null,"2010-01-23","09/10","08/09","07/08",null,"2010-01-23","09/10","08/09","07/08"]
[null,null,null,null,null,null,null,"2010-01-24","09/10","08/09","07/08",null,"2010-01-24","09/10","08/09","07/08"]
[null,null,null,null,null,null,null,"2010-01-25","09/10","08/09","07/08",null,"2010-01-25","09/10","08/09","07/08"]
[null,null,null,null,null,null,null,"2010-01-26","09/10","08/09","07/08",null,"2010-01-26","09/10","08/09","07/08"]
[null,null,null,null,null,null,null,"2010-01-27","09/10","08/09","07/08",null,"2010-01-27","09/10","08/09","07/08"]
[null,null,null,null,null,null,null,"2010-01-28","09/10","08/09","07/08",null,"2010-01-28","09/10","08/09","07/08"]
[null,null,null,null,null,null,null,"2010-01-29","09/10","08/09","07/08",null,"2010-01-29","09/10","08/09","07/08"]
[null,null,null,null,null,null,null,"2010-01-30","09/10","08/09","07/08",null,"2010-01-30","09/10","08/09","07/08"]
[null,null,null,null,null,null,null,"2010-01-31","09/10","08/09","07/08",null,"2010-01-31","09/10","08/09","07/08"]
[null,null,null,null,null,null,null,"2010-02-01","09/10","08/09","07/08",null,"2010-02-01","09/10","08/09","07/08"]
[null,null,null,null,null,null,null,"2010-02-02","09/10","08/09","07/08",null,"2010-02-02","09/10","08/09","07/08"]
[null,null,null,null,null,null,null,"2010-02-03","09/10","08/09","07/08",null,"2010-02-03","09/10","08/09","07/08"]
[null,null,null,null,null,null,null,"2010-02-04","09/10","08/09","07/08",null,"2010-02-04","09/10","08/09","07/08"]
[null,null,null,null,null,null,null,"2010-02-05","09/10","08/09","07/08",null,"2010-02-05","09/10","08/09","07/08"]
[null,null,null,null,null,null,null,"2010-02-06","09/10","08/09","07/08",null,"2010-02-06","09/10","08/09","07/08"]
[null,null,null,null,null,null,null,"2010-02-07","09/10","08/09","07/08",null,"2010-02-07","09/10","08/09","07/08"]
[null,null,null,null,null,null,null,"2010-02-08","09/10","08/09","07/08",null,"2010-02-08","09/10","08/09","07/08"]
[null,null,null,null,null,null,null,"2010-02-09","09/10","08/09","07/08",null,"2010-02-09","09/10","08/09","07/08"]
[null,null,null,null,null,null,null,"2010-02-10","09/10","08/09","07/08",null,"2010-02-10","09/10","08/09","07/08"]
[null,null,null,null,null,null,null,"2010-02-11","09/10","08/09","07/08",null,"2010-02-11","09/10","08/09","07/08"]
[null,null,null,null,null,null,null,"2010-02-12","09/10","08/09","07/08",null,"2010-02-12","09/10","08/09","07/08"]
[null,null,null,null,null,null,null,"2010-02-13","09/10","08/09","07/08",null,"2010-02-13","09/10","08/09","07/08"]
[null,null,null,null,null,null,null,"2010-02-14","09/10","08/09","07/08",null,"2010-02-14","09/10","08/09","07/08"]
[null,null,null,null,null,null,null,"2010-02-15","09/10","08/09","07/08",null,"2010-02-15","09/10","08/09","07/08"]
[null,null,null,null,null,null,null,"2010-02-16","09/10","08/09","07/08",null,"2010-02-16","09/10","08/09","07/08"]
[null,null,null,null,null,null,null,"2010-02-17","09/10","08/09","07/08",null,"2010-02-17","09/10","08/09","07/08"]
[null,null,null,null,null,null,null,"2010-02-18","09/10","08/09","07/08",null,"2010-02-18","09/10","08/09","07/08"]
[null,null,null,null,null,null,null,"2010-02-19","09/10","08/09","07/08",null,"2010-02-19","09/10","08/09","07/08"]
[null,null,null,null,null,null,null,"2010-02-20","09/10","08/09","07/08",null,"2010-02-20","09/10","08/09","07/08"]
[null,null,null,null,null,null,null,"2010-02-21","09/10","08/09","07/08",null,"2010-02-21","09/10","08/09","07/08"]
[null,null,null,null,null,null,null,"2010-02-22","09/10","08/09","07/08",null,"2010-02-22","09/10","08/09","07/08"]
[null,null,null,null,null,null,null,"2010-02-23","09/10","08/09","07/08",null,"2010-02-23","09/10","08/09","07/08"]
[null,null,null,null,null,null,null,"2010-02-24","09/10","08/09","07/08",null,"2010-02-24","09/10","08/09","07/08"]
[null,null,null,null,null,null,null,"2010-02-25","09/10","08/09","07/08",null,"2010-02-25","09/10","08/09","07/08"]
[null,null,null,null,null,null,null,"2010-02-26","09/10","08/09","07/08",null,"2010-02-26","09/10","08/09","07/08"]
[null,null,null,null,null,null,null,"2010-02-27","09/10","08/09","07/08",null,"2010-02-27","09/10","08/09","07/08"]
[null,null,null,null,null,null,null,"2010-02-28","09/10","08/09","07/08",null,"2010-02-28","09/10","08/09","07/08"]
[null,null,null,null,null,null,null,"2010-03-01","09/10","08/09","07/08",null,"2010-03-01","09/10","08/09","07/08"]
[null,null,null,null,null,null,null,"2010-03-02","09/10","08/09","07/08",null,"2010-03-02","09/10","08/09","07/08"]
[null,null,null,null,null,null,null,"2010-03-03","09/10","08/09","07/08",null,"2010-03-03","09/10","08/09","07/08"]
[null,null,null,null,null,null,null,"2010-03-04","09/10","08/09","07/08",null,"2010-03-04","09/10","08/09","07/08"]
[null,null,null,null,null,null,null,"2010-03-05","09/10","08/09","07/08",null,"2010-03-05","09/10","08/09","07/08"]
[null,null,null,null,null,null,null,"2010-03-06","09/10","08/09","07/08",null,"2010-03-06","09/10","08/09","07/08"]
[null,null,null,null,null,null,null,"2010-03-07","09/10","08/09","07/08",null,"2010-03-07","09/10","08/09","07/08"]
[null,null,null,null,null,null,null,"2010-03-08","09/10","08/09","07/08",null,"2010-03-08","09/10","08/09","07/08"]
[null,null,null,null,null,null,null,"2010-03-09","09/10","08/09","07/08",null,"2010-03-09","09/10","08/09","07/08"]
[null,null,null,null,null,null,null,"2010-03-10","09/10","08/09","07/08",null,"2010-03-10","09/10","08/09","07/08"]
[null,null,null,null,null,null,null,"2010-03-11","09/10","08/09","07/08",null,"2010-03-11","09/10","08/09","07/08"]
[null,null,null,null,null,null,null,"2010-03-12","09/10","08/09","07/08",null,"2010-03-12","09/10","08/09","07/08"]
[null,null,null,null,null,null,null,"2010-03-13","09/10","08/09","07/08",null,"2010-03-13","09/10","08/09","07/08"]
[null,null,null,null,null,null,null,"2010-03-14","09/10","08/09","07/08",null,"2010-03-14","09/10","08/09","07/08"]
[null,null,null,null,null,null,null,"2010-03-15","09/10","08/09","07/08",null,"2010-03-15","09/10","08/09","07/08"]
[null,null,null,null,null,null,null,"2010-03-16","09/10","08/09","07/08",null,"2010-03-16","09/10","08/09","07/08"]
[null,null,null,null,null,null,null,"2010-03-17","09/10","08/09","07/08",null,"2010-03-17","09/10","08/09","07/08"]
[null,null,null,null,null,null,null,"2010-03-18","09/10","08/09","07/08",null,"2010-03-18","09/10","08/09","07/08"]
[null,null,null,null,null,null,null,"2010-03-19","09/10","08/09","07/08",null,"2010-03-19","09/10","08/09","07/08"]
[null,null,null,null,null,null,null,"2010-03-20","09/10","08/09","07/08",null,"2010-03-20","09/10","08/09","07/08"]
[null,null,null,null,null,null,null,"2010-03-21","09/10","08/09","07/08",null,"2010-03-21","09/10","08/09","07/08"]
[null,null,null,null,null,null,null,"2010-03-22","09/10","08/09","07/08",null,"2010-03-22","09/10","08/09","07/08"]
[null,null,null,null,null,null,null,"2010-03-23","09/10","08/09","07/08",null,"2010-03-23","09/10","08/09","07/08"]
[null,null,null,null,null,null,null,"2010-03-24","09/10","08/09","07/08",null,"2010-03-24","09/10","08/09","07/08"]
[null,null,null,null,null,null,null,"2010-03-25","09/10","08/09","07/08",null,"2010-03-25","09/10","08/09","07/08"]
[null,null,null,null,null,null,null,"2010-03-26","09/10","08/09","07/08",null,"2010-03-26","09/10","08/09","07/08"]
[null,null,null,null,null,null,null,"2010-03-27","09/10","08/09","07/08",null,"2010-03-27","09/10","08/09","07/08"]
[null,null,null,null,null,null,null,"2010-03-28","09/10","08/09","07/08",null,"2010-03-28","09/10","08/09","07/08"]
[null,null,null,null,null,null,null,"2010-03-29","09/10","08/09","07/08",null,"2010-03-29","09/10","08/09","07/08"]
[null,null,null,null,null,null,null,"2010-03-30","09/10","08/09","07/08",null,"2010-03-30","09/10","08/09","07/08"]
[null,null,null,null,null,null,null,"2010-03-31","09/10","08/09","07/08",null,"2010-03-31","09/10","08/09","07/08"]
[null,null,null,null,null,null,null,"2010-04-01","09/10","08/09","07/08",null,"2010-04-01","09/10","08/09","07/08"]
[null,null,null,null,null,null,null,"2010-04-02","09/10","08/09","07/08",null,"2010-04-02","09/10","08/09","07/08"]
[null,null,null,null,null,null,null,"2010-04-03","09/10","08/09","07/08",null,"2010-04-03","09/10","08/09","07/08"]
[null,null,null,null,null,null,null,"2010-04-04","09/10","08/09","07/08",null,"2010-04-04","09/10","08/09","07/08"]
[null,null,null,null,null,null,null,"2010-04-05","09/10","08/09","07/08",null,"2010-04-05","09/10","08/09","07/08"]
[null,null,null,null,null,null,null,"2010-04-06","10/11","09/10","08/09",null,"2010-04-06","10/11","09/10","08/09"]
[null,null,null,null,null,null,null,"2010-04-07","10/11","09/10","08/09",null,"2010-04-07","10/11","09/10","08/09"]
[null,null,null,null,null,null,null,"2010-04-08","10/11","09/10","08/09",null,"2010-04-08","10/11","09/10","08/09"]
[null,null,null,null,null,null,null,"2010-04-09","10/11","09/10","08/09",null,"2010-04-09","10/11","09/10","08/09"]
[null,null,null,null,null,null,null,"2010-04-10","10/11","09/10","08/09",null,"2010-04-10","10/11","09/10","08/09"]
[null,null,null,null,null,null,null,"2010-04-11","10/11","09/10","08/09",null,"2010-04-11","10/11","09/10","08/09"]
[null,null,null,null,null,null,null,"2010-04-12","10/11","09/10","08/09",null,"2010-04-12","10/11","09/10","08/09"]
[null,null,null,null,null,null,null,"2010-04-13","10/11","09/10","08/09",null,"2010-04-13","10/11","09/10","08/09"]
[null,null,null,null,null,null,null,"2010-04-14","10/11","09/10","08/09",null,"2010-04-14","10/11","09/10","08/09"]
[null,null,null,null,null,null,null,"2010-04-15","10/11","09/10","08/09",null,"2010-04-15","10/11","09/10","08/09"]
[null,null,null,null,null,null,null,"2010-04-16","10/11","09/10","08/09",null,"2010-04-16","10/11","09/10","08/09"]
[null,null,null,null,null,null,null,"2010-04-17","10/11","09/10","08/09",null,"2010-04-17","10/11","09/10","08/09"]
[null,null,null,null,null,null,null,"2010-04-18","10/11","09/10","08/09",null,"2010-04-18","10/11","09/10","08/09"]
[null,null,null,null,null,null,null,"2010-04-19","10/11","09/10","08/09",null,"2010-04-19","10/11","09/10","08/09"]
[null,null,null,null,null,null,null,"2010-04-20","10/11","09/10","08/09",null,"2010-04-20","10/11","09/10","08/09"]
[null,null,null,null,null,null,null,"2010-04-21","10/11","09/10","08/09",null,"2010-04-21","10/11","09/10","08/09"]
[null,null,null,null,null,null,null,"2010-04-22","10/11","09/10","08/09",null,"2010-04-22","10/11","09/10","08/09"]
[null,null,null,null,null,null,null,"2010-04-23","10/11","09/10","08/09",null,"2010-04-23","10/11","09/10","08/09"]
[null,null,null,null,null,null,null,"2010-04-24","10/11","09/10","08/09",null,"2010-04-24","10/11","09/10","08/09"]
[null,null,null,null,null,null,null,"2010-04-25","10/11","09/10","08/09",null,"2010-04-25","10/11","09/10","08/09"]
[null,null,null,null,null,null,null,"2010-04-26","10/11","09/10","08/09",null,"2010-04-26","10/11","09/10","08/09"]
[null,null,null,null,null,null,null,"2010-04-27","10/11","09/10","08/09",null,"2010-04-27","10/11","09/10","08/09"]
[null,null,null,null,null,null,null,"2010-04-28","10/11","09/10","08/09",null,"2010-04-28","10/11","09/10","08/09"]
[null,null,null,null,null,null,null,"2010-04-29","10/11","09/10","08/09",null,"2010-04-29","10/11","09/10","08/09"]
[null,null,null,null,null,null,null,"2010-04-30","10/11","09/10","08/09",null,"2010-04-30","10/11","09/10","08/09"]
[null,null,null,null,null,null,null,"2010-05-01","10/11","09/10","08/09",null,"2010-05-01","10/11","09/10","08/09"]
[null,null,null,null,null,null,null,"2010-05-02","10/11","09/10","08/09",null,"2010-05-02","10/11","09/10","08/09"]
[null,null,null,null,null,null,null,"2010-05-03","10/11","09/10","08/09",null,"2010-05-03","10/11","09/10","08/09"]
[null,null,null,null,null,null,null,"2010-05-04","10/11","09/10","08/09",null,"2010-05-04","10/11","09/10","08/09"]
[null,null,null,null,null,null,null,"2010-05-05","10/11","09/10","08/09",null,"2010-05-05","10/11","09/10","08/09"]
[null,null,null,null,null,null,null,"2010-05-06","10/11","09/10","08/09",null,"2010-05-06","10/11","09/10","08/09"]
[null,null,null,null,null,null,null,"2010-05-07","10/11","09/10","08/09",null,"2010-05-07","10/11","09/10","08/09"]
[null,null,null,null,null,null,null,"2010-05-08","10/11","09/10","08/09",null,"2010-05-08","10/11","09/10","08/09"]
[null,null,null,null,null,null,null,"2010-05-09","10/11","09/10","08/09",null,"2010-05-09","10/11","09/10","08/09"]
[null,null,null,null,null,null,null,"2010-05-10","10/11","09/10","08/09",null,"2010-05-10","10/11","09/10","08/09"]
[null,null,null,null,null,null,null,"2010-05-11","10/11","09/10","08/09",null,"2010-05-11","10/11","09/10","08/09"]
[null,null,null,null,null,null,null,"2010-05-12","10/11","09/10","08/09",null,"2010-05-12","10/11","09/10","08/09"]
[null,null,null,null,null,null,null,"2010-05-13","10/11","09/10","08/09",null,"2010-05-13","10/11","09/10","08/09"]
[null,null,null,null,null,null,null,"2010-05-14","10/11","09/10","08/09",null,"2010-05-14","10/11","09/10","08/09"]
[null,null,null,null,null,null,null,"2010-05-15","10/11","09/10","08/09",null,"2010-05-15","10/11","09/10","08/09"]
[null,null,null,null,null,null,null,"2010-05-16","10/11","09/10","08/09",null,"2010-05-16","10/11","09/10","08/09"]
[null,null,null,null,null,null,null,"2010-05-17","10/11","09/10","08/09",null,"2010-05-17","10/11","09/10","08/09"]
[null,null,null,null,null,null,null,"2010-05-18","10/11","09/10","08/09",null,"2010-05-18","10/11","09/10","08/09"]
[null,null,null,null,null,null,null,"2010-05-19","10/11","09/10","08/09",null,"2010-05-19","10/11","09/10","08/09"]
[null,null,null,null,null,null,null,"2010-05-20","10/11","09/10","08/09",null,"2010-05-20","10/11","09/10","08/09"]
[null,null,null,null,null,null,null,"2010-05-21","10/11","09/10","08/09",null,"2010-05-21","10/11","09/10","08/09"]
[null,null,null,null,null,null,null,"2010-05-22","10/11","09/10","08/09",null,"2010-05-22","10/11","09/10","08/09"]
[null,null,null,null,null,null,null,"2010-05-23","10/11","09/10","08/09",null,"2010-05-23","10/11","09/10","08/09"]
[null,null,null,null,null,null,null,"2010-05-24","10/11","09/10","08/09",null,"2010-05-24","10/11","09/10","08/09"]
[null,null,null,null,null,null,null,"2010-05-25","10/11","09/10","08/09",null,"2010-05-25","10/11","09/10","08/09"]
[null,null,null,null,null,null,null,"2010-05-26","10/11","09/10","08/09",null,"2010-05-26","10/11","09/10","08/09"]
[null,null,null,null,null,null,null,"2010-05-27","10/11","09/10","08/09",null,"2010-05-27","10/11","09/10","08/09"]
[null,null,null,null,null,null,null,"2010-05-28","10/11","09/10","08/09",null,"2010-05-28","10/11","09/10","08/09"]
[null,null,null,null,null,null,null,"2010-05-29","10/11","09/10","08/09",null,"2010-05-29","10/11","09/10","08/09"]
[null,null,null,null,null,null,null,"2010-05-30","10/11","09/10","08/09",null,"2010-05-30","10/11","09/10","08/09"]
[null,null,null,null,null,null,null,"2010-05-31","10/11","09/10","08/09",null,"2010-05-31","10/11","09/10","08/09"]
[null,null,null,null,null,null,null,"2010-06-01","10/11","09/10","08/09",null,"2010-06-01","10/11","09/10","08/09"]
[null,null,null,null,null,null,null,"2010-06-02","10/11","09/10","08/09",null,"2010-06-02","10/11","09/10","08/09"]
[null,null,null,null,null,null,null,"2010-06-03","10/11","09/10","08/09",null,"2010-06-03","10/11","09/10","08/09"]
[null,null,null,null,null,null,null,"2010-06-04","10/11","09/10","08/09",null,"2010-06-04","10/11","09/10","08/09"]
[null,null,null,null,null,null,null,"2010-06-05","10/11","09/10","08/09",null,"2010-06-05","10/11","09/10","08/09"]
[null,null,null,null,null,null,null,"2010-06-06","10/11","09/10","08/09",null,"2010-06-06","10/11","09/10","08/09"]
[null,null,null,null,null,null,null,"2010-06-07","10/11","09/10","08/09",null,"2010-06-07","10/11","09/10","08/09"]
[null,null,null,null,null,null,null,"2010-06-08","10/11","09/10","08/09",null,"2010-06-08","10/11","09/10","08/09"]
[null,null,null,null,null,null,null,"2010-06-09","10/11","09/10","08/09",null,"2010-06-09","10/11","09/10","08/09"]
[null,null,null,null,null,null,null,"2010-06-10","10/11","09/10","08/09",null,"2010-06-10","10/11","09/10","08/09"]
[null,null,null,null,null,null,null,"2010-06-11","10/11","09/10","08/09",null,"2010-06-11","10/11","09/10","08/09"]
[null,null,null,null,null,null,null,"2010-06-12","10/11","09/10","08/09",null,"2010-06-12","10/11","09/10","08/09"]
[null,null,null,null,null,null,null,"2010-06-13","10/11","09/10","08/09",null,"2010-06-13","10/11","09/10","08/09"]
[null,null,null,null,null,null,null,"2010-06-14","10/11","09/10","08/09",null,"2010-06-14","10/11","09/10","08/09"]
[null,null,null,null,null,null,null,"2010-06-15","10/11","09/10","08/09",null,"2010-06-15","10/11","09/10","08/09"]
[null,null,null,null,null,null,null,"2010-06-16","10/11","09/10","08/09",null,"2010-06-16","10/11","09/10","08/09"]
[null,null,null,null,null,null,null,"2010-06-17","10/11","09/10","08/09",null,"2010-06-17","10/11","09/10","08/09"]
[null,null,null,null,null,null,null,"2010-06-18","10/11","09/10","08/09",null,"2010-06-18","10/11","09/10","08/09"]
[null,null,null,null,null,null,null,"2010-06-19","10/11","09/10","08/09",null,"2010-06-19","10/11","09/10","08/09"]
[null,null,null,null,null,null,null,"2010-06-20","10/11","09/10","08/09",null,"2010-06-20","10/11","09/10","08/09"]
[null,null,null,null,null,null,null,"2010-06-21","10/11","09/10","08/09",null,"2010-06-21","10/11","09/10","08/09"]
[null,null,null,null,null,null,null,"2010-06-22","10/11","09/10","08/09",null,"2010-06-22","10/11","09/10","08/09"]
[null,null,null,null,null,null,null,"2010-06-23","10/11","09/10","08/09",null,"2010-06-23","10/11","09/10","08/09"]
[null,null,null,null,null,null,null,"2010-06-24","10/11","09/10","08/09",null,"2010-06-24","10/11","09/10","08/09"]
[null,null,null,null,null,null,null,"2010-06-25","10/11","09/10","08/09",null,"2010-06-25","10/11","09/10","08/09"]
[null,null,null,null,null,null,null,"2010-06-26","10/11","09/10","08/09",null,"2010-06-26","10/11","09/10","08/09"]
[null,null,null,null,null,null,null,"2010-06-27","10/11","09/10","08/09",null,"2010-06-27","10/11","09/10","08/09"]
[null,null,null,null,null,null,null,"2010-06-28","10/11","09/10","08/09",null,"2010-06-28","10/11","09/10","08/09"]
[null,null,null,null,null,null,null,"2010-06-29","10/11","09/10","08/09",null,"2010-06-29","10/11","09/10","08/09"]
[null,null,null,null,null,null,null,"2010-06-30","10/11","09/10","08/09",null,"2010-06-30","10/11","09/10","08/09"]
[null,null,null,null,null,null,null,"2010-07-01","10/11","09/10","08/09",null,"2010-07-01","10/11","09/10","08/09"]
[null,null,null,null,null,null,null,"2010-07-02","10/11","09/10","08/09",null,"2010-07-02","10/11","09/10","08/09"]
[null,null,null,null,null,null,null,"2010-07-03","10/11","09/10","08/09",null,"2010-07-03","10/11","09/10","08/09"]
[null,null,null,null,null,null,null,"2010-07-04","10/11","09/10","08/09",null,"2010-07-04","10/11","09/10","08/09"]
[null,null,null,null,null,null,null,"2010-07-05","10/11","09/10","08/09",null,"2010-07-05","10/11","09/10","08/09"]
[null,null,null,null,null,null,null,"2010-07-06","10/11","09/10","08/09",null,"2010-07-06","10/11","09/10","08/09"]
[null,null,null,null,null,null,null,"2010-07-07","10/11","09/10","08/09",null,"2010-07-07","10/11","09/10","08/09"]
[null,null,null,null,null,null,null,"2010-07-08","10/11","09/10","08/09",null,"2010-07-08","10/11","09/10","08/09"]
[null,null,null,null,null,null,null,"2010-07-09","10/11","09/10","08/09",null,"2010-07-09","10/11","09/10","08/09"]
[null,null,null,null,null,null,null,"2010-07-10","10/11","09/10","08/09",null,"2010-07-10","10/11","09/10","08/09"]
[null,null,null,null,null,null,null,"2010-07-11","10/11","09/10","08/09",null,"2010-07-11","10/11","09/10","08/09"]
[null,null,null,null,null,null,null,"2010-07-12","10/11","09/10","08/09",null,"2010-07-12","10/11","09/10","08/09"]
[null,null,null,null,null,null,null,"2010-07-13","10/11","09/10","08/09",null,"2010-07-13","10/11","09/10","08/09"]
[null,null,null,null,null,null,null,"2010-07-14","10/11","09/10","08/09",null,"2010-07-14","10/11","09/10","08/09"]
[null,null,null,null,null,null,null,"2010-07-15","10/11","09/10","08/09",null,"2010-07-15","10/11","09/10","08/09"]
[null,null,null,null,null,null,null,"2010-07-16","10/11","09/10","08/09",null,"2010-07-16","10/11","09/10","08/09"]
[null,null,null,null,null,null,null,"2010-07-17","10/11","09/10","08/09",null,"2010-07-17","10/11","09/10","08/09"]
[null,null,null,null,null,null,null,"2010-07-18","10/11","09/10","08/09",null,"2010-07-18","10/11","09/10","08/09"]
[null,null,null,null,null,null,null,"2010-07-19","10/11","09/10","08/09",null,"2010-07-19","10/11","09/10","08/09"]
[null,null,null,null,null,null,null,"2010-07-20","10/11","09/10","08/09",null,"2010-07-20","10/11","09/10","08/09"]
[null,null,null,null,null,null,null,"2010-07-21","10/11","09/10","08/09",null,"2010-07-21","10/11","09/10","08/09"]
[null,null,null,null,null,null,null,"2010-07-22","10/11","09/10","08/09",null,"2010-07-22","10/11","09/10","08/09"]
[null,null,null,null,null,null,null,"2010-07-23","10/11","09/10","08/09",null,"2010-07-23","10/11","09/10","08/09"]
[null,null,null,null,null,null,null,"2010-07-24","10/11","09/10","08/09",null,"2010-07-24","10/11","09/10","08/09"]
[null,null,null,null,null,null,null,"2010-07-25","10/11","09/10","08/09",null,"2010-07-25","10/11","09/10","08/09"]
[null,null,null,null,null,null,null,"2010-07-26","10/11","09/10","08/09",null,"2010-07-26","10/11","09/10","08/09"]
[null,null,null,null,null,null,null,"2010-07-27","10/11","09/10","08/09",null,"2010-07-27","10/11","09/10","08/09"]
[null,null,null,null,null,null,null,"2010-07-28","10/11","09/10","08/09",null,"2010-07-28","10/11","09/10","08/09"]
[null,null,null,null,null,null,null,"2010-07-29","10/11","09/10","08/09",null,"2010-07-29","10/11","09/10","08/09"]
[null,null,null,null,null,null,null,"2010-07-30","10/11","09/10","08/09",null,"2010-07-30","10/11","09/10","08/09"]
[null,null,null,null,null,null,null,"2010-07-31","10/11","09/10","08/09",null,"2010-07-31","10/11","09/10","08/09"]
[null,null,null,null,null,null,null,"2010-08-01","10/11","09/10","08/09",null,"2010-08-01","10/11","09/10","08/09"]
[null,null,null,null,null,null,null,"2010-08-02","10/11","09/10","08/09",null,"2010-08-02","10/11","09/10","08/09"]
[null,null,null,null,null,null,null,"2010-08-03","10/11","09/10","08/09",null,"2010-08-03","10/11","09/10","08/09"]
[null,null,null,null,null,null,null,"2010-08-04","10/11","09/10","08/09",null,"2010-08-04","10/11","09/10","08/09"]
[null,null,null,null,null,null,null,"2010-08-05","10/11","09/10","08/09",null,"2010-08-05","10/11","09/10","08/09"]
[null,null,null,null,null,null,null,"2010-08-06","10/11","09/10","08/09",null,"2010-08-06","10/11","09/10","08/09"]
[null,null,null,null,null,null,null,"2010-08-07","10/11","09/10","08/09",null,"2010-08-07","10/11","09/10","08/09"]
[null,null,null,null,null,null,null,"2010-08-08","10/11","09/10","08/09",null,"2010-08-08","10/11","09/10","08/09"]
[null,null,null,null,null,null,null,"2010-08-09","10/11","09/10","08/09",null,"2010-08-09","10/11","09/10","08/09"]
[null,null,null,null,null,null,null,"2010-08-10","10/11","09/10","08/09",null,"2010-08-10","10/11","09/10","08/09"]
[null,null,null,null,null,null,null,"2010-08-11","10/11","09/10","08/09",null,"2010-08-11","10/11","09/10","08/09"]
[null,null,null,null,null,null,null,"2010-08-12","10/11","09/10","08/09",null,"2010-08-12","10/11","09/10","08/09"]
[null,null,null,null,null,null,null,"2010-08-13","10/11","09/10","08/09",null,"2010-08-13","10/11","09/10","08/09"]
[null,null,null,null,null,null,null,"2010-08-14","10/11","09/10","08/09",null,"2010-08-14","10/11","09/10","08/09"]
[null,null,null,null,null,null,null,"2010-08-15","10/11","09/10","08/09",null,"2010-08-15","10/11","09/10","08/09"]
[null,null,null,null,null,null,null,"2010-08-16","10/11","09/10","08/09",null,"2010-08-16","10/11","09/10","08/09"]
[null,null,null,null,null,null,null,"2010-08-17","10/11","09/10","08/09",null,"2010-08-17","10/11","09/10","08/09"]
[null,null,null,null,null,null,null,"2010-08-18","10/11","09/10","08/09",null,"2010-08-18","10/11","09/10","08/09"]
[null,null,null,null,null,null,null,"2010-08-19","10/11","09/10","08/09",null,"2010-08-19","10/11","09/10","08/09"]
[null,null,null,null,null,null,null,"2010-08-20","10/11","09/10","08/09",null,"2010-08-20","10/11","09/10","08/09"]
[null,null,null,null,null,null,null,"2010-08-21","10/11","09/10","08/09",null,"2010-08-21","10/11","09/10","08/09"]
[null,null,null,null,null,null,null,"2010-08-22","10/11","09/10","08/09",null,"2010-08-22","10/11","09/10","08/09"]
[null,null,null,null,null,null,null,"2010-08-23","10/11","09/10","08/09",null,"2010-08-23","10/11","09/10","08/09"]
[null,null,null,null,null,null,null,"2010-08-24","10/11","09/10","08/09",null,"2010-08-24","10/11","09/10","08/09"]
[null,null,null,null,null,null,null,"2010-08-25","10/11","09/10","08/09",null,"2010-08-25","10/11","09/10","08/09"]
[null,null,null,null,null,null,null,"2010-08-26","10/11","09/10","08/09",null,"2010-08-26","10/11","09/10","08/09"]
[null,null,null,null,null,null,null,"2010-08-27","10/11","09/10","08/09",null,"2010-08-27","10/11","09/10","08/09"]
[null,null,null,null,null,null,null,"2010-08-28","10/11","09/10","08/09",null,"2010-08-28","10/11","09/10","08/09"]
[null,null,null,null,null,null,null,"2010-08-29","10/11","09/10","08/09",null,"2010-08-29","10/11","09/10","08/09"]
[null,null,null,null,null,null,null,"2010-08-30","10/11","09/10","08/09",null,"2010-08-30","10/11","09/10","08/09"]
[null,null,null,null,null,null,null,"2010-08-31","10/11","09/10","08/09",null,"2010-08-31","10/11","09/10","08/09"]
[null,null,null,null,null,null,null,"2010-09-01","10/11","09/10","08/09",null,"2010-09-01","10/11","09/10","08/09"]
[null,null,null,null,null,null,null,"2010-09-02","10/11","09/10","08/09",null,"2010-09-02","10/11","09/10","08/09"]
[null,null,null,null,null,null,null,"2010-09-03","10/11","09/10","08/09",null,"2010-09-03","10/11","09/10","08/09"]
[null,null,null,null,null,null,null,"2010-09-04","10/11","09/10","08/09",null,"2010-09-04","10/11","09/10","08/09"]
[null,null,null,null,null,null,null,"2010-09-05","10/11","09/10","08/09",null,"2010-09-05","10/11","09/10","08/09"]
[null,null,null,null,null,null,null,"2010-09-06","10/11","09/10","08/09",null,"2010-09-06","10/11","09/10","08/09"]
[null,null,null,null,null,null,null,"2010-09-07","10/11","09/10","08/09",null,"2010-09-07","10/11","09/10","08/09"]
[null,null,null,null,null,null,null,"2010-09-08","10/11","09/10","08/09",null,"2010-09-08","10/11","09/10","08/09"]
[null,null,null,null,null,null,null,"2010-09-09","10/11","09/10","08/09",null,"2010-09-09","10/11","09/10","08/09"]
[null,null,null,null,null,null,null,"2010-09-10","10/11","09/10","08/09",null,"2010-09-10","10/11","09/10","08/09"]
[null,null,null,null,null,null,null,"2010-09-11","10/11","09/10","08/09",null,"2010-09-11","10/11","09/10","08/09"]
[null,null,null,null,null,null,null,"2010-09-12","10/11","09/10","08/09",null,"2010-09-12","10/11","09/10","08/09"]
[null,null,null,null,null,null,null,"2010-09-13","10/11","09/10","08/09",null,"2010-09-13","10/11","09/10","08/09"]
[null,null,null,null,null,null,null,"2010-09-14","10/11","09/10","08/09",null,"2010-09-14","10/11","09/10","08/09"]
[null,null,null,null,null,null,null,"2010-09-15","10/11","09/10","08/09",null,"2010-09-15","10/11","09/10","08/09"]
[null,null,null,null,null,null,null,"2010-09-16","10/11","09/10","08/09",null,"2010-09-16","10/11","09/10","08/09"]
[null,null,null,null,null,null,null,"2010-09-17","10/11","09/10","08/09",null,"2010-09-17","10/11","09/10","08/09"]
[null,null,null,null,null,null,null,"2010-09-18","10/11","09/10","08/09",null,"2010-09-18","10/11","09/10","08/09"]
[null,null,null,null,null,null,null,"2010-09-19","10/11","09/10","08/09",null,"2010-09-19","10/11","09/10","08/09"]
[null,null,null,null,null,null,null,"2010-09-20","10/11","09/10","08/09",null,"2010-09-20","10/11","09/10","08/09"]
[null,null,null,null,null,null,null,"2010-09-21","10/11","09/10","08/09",null,"2010-09-21","10/11","09/10","08/09"]
[null,null,null,null,null,null,null,"2010-09-22","10/11","09/10","08/09",null,"2010-09-22","10/11","09/10","08/09"]
[null,null,null,null,null,null,null,"2010-09-23","10/11","09/10","08/09",null,"2010-09-23","10/11","09/10","08/09"]
[null,null,null,null,null,null,null,"2010-09-24","10/11","09/10","08/09",null,"2010-09-24","10/11","09/10","08/09"]
[null,null,null,null,null,null,null,"2010-09-25","10/11","09/10","08/09",null,"2010-09-25","10/11","09/10","08/09"]
[null,null,null,null,null,null,null,"2010-09-26","10/11","09/10","08/09",null,"2010-09-26","10/11","09/10","08/09"]
[null,null,null,null,null,null,null,"2010-09-27","10/11","09/10","08/09",null,"2010-09-27","10/11","09/10","08/09"]
[null,null,null,null,null,null,null,"2010-09-28","10/11","09/10","08/09",null,"2010-09-28","10/11","09/10","08/09"]
[null,null,null,null,null,null,null,"2010-09-29","10/11","09/10","08/09",null,"2010-09-29","10/11","09/10","08/09"]
[null,null,null,null,null,null,null,"2010-09-30","10/11","09/10","08/09",null,"2010-09-30","10/11","09/10","08/09"]
[null,null,null,null,null,null,null,"2010-10-01","10/11","09/10","08/09",null,"2010-10-01","10/11","09/10","08/09"]
[null,null,null,null,null,null,null,"2010-10-02","10/11","09/10","08/09",null,"2010-10-02","10/11","09/10","08/09"]
[null,null,null,null,null,null,null,"2010-10-03","10/11","09/10","08/09",null,"2010-10-03","10/11","09/10","08/09"]
[null,null,null,null,null,null,null,"2010-10-04","10/11","09/10","08/09",null,"2010-10-04","10/11","09/10","08/09"]
[null,null,null,null,null,null,null,"2010-10-05","10/11","09/10","08/09",null,"2010-10-05","10/11","09/10","08/09"]
[null,null,null,null,null,null,null,"2010-10-06","10/11","09/10","08/09",null,"2010-10-06","10/11","09/10","08/09"]
[null,null,null,null,null,null,null,"2010-10-07","10/11","09/10","08/09",null,"2010-10-07","10/11","09/10","08/09"]
[null,null,null,null,null,null,null,"2010-10-08","10/11","09/10","08/09",null,"2010-10-08","10/11","09/10","08/09"]
[null,null,null,null,null,null,null,"2010-10-09","10/11","09/10","08/09",null,"2010-10-09","10/11","09/10","08/09"]
[null,null,null,null,null,null,null,"2010-10-10","10/11","09/10","08/09",null,"2010-10-10","10/11","09/10","08/09"]
[null,null,null,null,null,null,null,"2010-10-11","10/11","09/10","08/09",null,"2010-10-11","10/11","09/10","08/09"]
[null,null,null,null,null,null,null,"2010-10-12","10/11","09/10","08/09",null,"2010-10-12","10/11","09/10","08/09"]
[null,null,null,null,null,null,null,"2010-10-13","10/11","09/10","08/09",null,"2010-10-13","10/11","09/10","08/09"]
[null,null,null,null,null,null,null,"2010-10-14","10/11","09/10","08/09",null,"2010-10-14","10/11","09/10","08/09"]
[null,null,null,null,null,null,null,"2010-10-15","10/11","09/10","08/09",null,"2010-10-15","10/11","09/10","08/09"]
[null,null,null,null,null,null,null,"2010-10-16","10/11","09/10","08/09",null,"2010-10-16","10/11","09/10","08/09"]
[null,null,null,null,null,null,null,"2010-10-17","10/11","09/10","08/09",null,"2010-10-17","10/11","09/10","08/09"]
[null,null,null,null,null,null,null,"2010-10-18","10/11","09/10","08/09",null,"2010-10-18","10/11","09/10","08/09"]
[null,null,null,null,null,null,null,"2010-10-19","10/11","09/10","08/09",null,"2010-10-19","10/11","09/10","08/09"]
[null,null,null,null,null,null,null,"2010-10-20","10/11","09/10","08/09",null,"2010-10-20","10/11","09/10","08/09"]
[null,null,null,null,null,null,null,"2010-10-21","10/11","09/10","08/09",null,"2010-10-21","10/11","09/10","08/09"]
[null,null,null,null,null,null,null,"2010-10-22","10/11","09/10","08/09",null,"2010-10-22","10/11","09/10","08/09"]
[null,null,null,null,null,null,null,"2010-10-23","10/11","09/10","08/09",null,"2010-10-23","10/11","09/10","08/09"]
[null,null,null,null,null,null,null,"2010-10-24","10/11","09/10","08/09",null,"2010-10-24","10/11","09/10","08/09"]
[null,null,null,null,null,null,null,"2010-10-25","10/11","09/10","08/09",null,"2010-10-25","10/11","09/10","08/09"]
[null,null,null,null,null,null,null,"2010-10-26","10/11","09/10","08/09",null,"2010-10-26","10/11","09/10","08/09"]
[null,null,null,null,null,null,null,"2010-10-27","10/11","09/10","08/09",null,"2010-10-27","10/11","09/10","08/09"]
[null,null,null,null,null,null,null,"2010-10-28","10/11","09/10","08/09",null,"2010-10-28","10/11","09/10","08/09"]
[null,null,null,null,null,null,null,"2010-10-29","10/11","09/10","08/09",null,"2010-10-29","10/11","09/10","08/09"]
[null,null,null,null,null,null,null,"2010-10-30","10/11","09/10","08/09",null,"2010-10-30","10/11","09/10","08/09"]
[null,null,null,null,null,null,null,"2010-10-31","10/11","09/10","08/09",null,"2010-10-31","10/11","09/10","08/09"]
[null,null,null,null,null,null,null,"2010-11-01","10/11","09/10","08/09",null,"2010-11-01","10/11","09/10","08/09"]
[null,null,null,null,null,null,null,"2010-11-02","10/11","09/10","08/09",null,"2010-11-02","10/11","09/10","08/09"]
[null,null,null,null,null,null,null,"2010-11-03","10/11","09/10","08/09",null,"2010-11-03","10/11","09/10","08/09"]
[null,null,null,null,null,null,null,"2010-11-04","10/11","09/10","08/09",null,"2010-11-04","10/11","09/10","08/09"]
[null,null,null,null,null,null,null,"2010-11-05","10/11","09/10","08/09",null,"2010-11-05","10/11","09/10","08/09"]
[null,null,null,null,null,null,null,"2010-11-06","10/11","09/10","08/09",null,"2010-11-06","10/11","09/10","08/09"]
[null,null,null,null,null,null,null,"2010-11-07","10/11","09/10","08/09",null,"2010-11-07","10/11","09/10","08/09"]
[null,null,null,null,null,null,null,"2010-11-08","10/11","09/10","08/09",null,"2010-11-08","10/11","09/10","08/09"]
[null,null,null,null,null,null,null,"2010-11-09","10/11","09/10","08/09",null,"2010-11-09","10/11","09/10","08/09"]
[null,null,null,null,null,null,null,"2010-11-10","10/11","09/10","08/09",null,"2010-11-10","10/11","09/10","08/09"]
[null,null,null,null,null,null,null,"2010-11-11","10/11","09/10","08/09",null,"2010-11-11","10/11","09/10","08/09"]
[null,null,null,null,null,null,null,"2010-11-12","10/11","09/10","08/09",null,"2010-11-12","10/11","09/10","08/09"]
[null,null,null,null,null,null,null,"2010-11-13","10/11","09/10","08/09",null,"2010-11-13","10/11","09/10","08/09"]
[null,null,null,null,null,null,null,"2010-11-14","10/11","09/10","08/09",null,"2010-11-14","10/11","09/10","08/09"]
[null,null,null,null,null,null,null,"2010-11-15","10/11","09/10","08/09",null,"2010-11-15","10/11","09/10","08/09"]
[null,null,null,null,null,null,null,"2010-11-16","10/11","09/10","08/09",null,"2010-11-16","10/11","09/10","08/09"]
[null,null,null,null,null,null,null,"2010-11-17","10/11","09/10","08/09",null,"2010-11-17","10/11","09/10","08/09"]
[null,null,null,null,null,null,null,"2010-11-18","10/11","09/10","08/09",null,"2010-11-18","10/11","09/10","08/09"]
[null,null,null,null,null,null,null,"2010-11-19","10/11","09/10","08/09",null,"2010-11-19","10/11","09/10","08/09"]
[null,null,null,null,null,null,null,"2010-11-20","10/11","09/10","08/09",null,"2010-11-20","10/11","09/10","08/09"]
[null,null,null,null,null,null,null,"2010-11-21","10/11","09/10","08/09",null,"2010-11-21","10/11","09/10","08/09"]
[null,null,null,null,null,null,null,"2010-11-22","10/11","09/10","08/09",null,"2010-11-22","10/11","09/10","08/09"]
[null,null,null,null,null,null,null,"2010-11-23","10/11","09/10","08/09",null,"2010-11-23","10/11","09/10","08/09"]
[null,null,null,null,null,null,null,"2010-11-24","10/11","09/10","08/09",null,"2010-11-24","10/11","09/10","08/09"]
[null,null,null,null,null,null,null,"2010-11-25","10/11","09/10","08/09",null,"2010-11-25","10/11","09/10","08/09"]
[null,null,null,null,null,null,null,"2010-11-26","10/11","09/10","08/09",null,"2010-11-26","10/11","09/10","08/09"]
[null,null,null,null,null,null,null,"2010-11-27","10/11","09/10","08/09",null,"2010-11-27","10/11","09/10","08/09"]
[null,null,null,null,null,null,null,"2010-11-28","10/11","09/10","08/09",null,"2010-11-28","10/11","09/10","08/09"]
[null,null,null,null,null,null,null,"2010-11-29","10/11","09/10","08/09",null,"2010-11-29","10/11","09/10","08/09"]
[null,null,null,null,null,null,null,"2010-11-30","10/11","09/10","08/09",null,"2010-11-30","10/11","09/10","08/09"]
[null,null,null,null,null,null,null,"2010-12-01","10/11","09/10","08/09",null,"2010-12-01","10/11","09/10","08/09"]
[null,null,null,null,null,null,null,"2010-12-02","10/11","09/10","08/09",null,"2010-12-02","10/11","09/10","08/09"]
[null,null,null,null,null,null,null,"2010-12-03","10/11","09/10","08/09",null,"2010-12-03","10/11","09/10","08/09"]
[null,null,null,null,null,null,null,"2010-12-04","10/11","09/10","08/09",null,"2010-12-04","10/11","09/10","08/09"]
[null,null,null,null,null,null,null,"2010-12-05","10/11","09/10","08/09",null,"2010-12-05","10/11","09/10","08/09"]
[null,null,null,null,null,null,null,"2010-12-06","10/11","09/10","08/09",null,"2010-12-06","10/11","09/10","08/09"]
[null,null,null,null,null,null,null,"2010-12-07","10/11","09/10","08/09",null,"2010-12-07","10/11","09/10","08/09"]
[null,null,null,null,null,null,null,"2010-12-08","10/11","09/10","08/09",null,"2010-12-08","10/11","09/10","08/09"]
[null,null,null,null,null,null,null,"2010-12-09","10/11","09/10","08/09",null,"2010-12-09","10/11","09/10","08/09"]
[null,null,null,null,null,null,null,"2010-12-10","10/11","09/10","08/09",null,"2010-12-10","10/11","09/10","08/09"]
[null,null,null,null,null,null,null,"2010-12-11","10/11","09/10","08/09",null,"2010-12-11","10/11","09/10","08/09"]
[null,null,null,null,null,null,null,"2010-12-12","10/11","09/10","08/09",null,"2010-12-12","10/11","09/10","08/09"]
[null,null,null,null,null,null,null,"2010-12-13","10/11","09/10","08/09",null,"2010-12-13","10/11","09/10","08/09"]
[null,null,null,null,null,null,null,"2010-12-14","10/11","09/10","08/09",null,"2010-12-14","10/11","09/10","08/09"]
[null,null,null,null,null,null,null,"2010-12-15","10/11","09/10","08/09",null,"2010-12-15","10/11","09/10","08/09"]
[null,null,null,null,null,null,null,"2010-12-16","10/11","09/10","08/09",null,"2010-12-16","10/11","09/10","08/09"]
[null,null,null,null,null,null,null,"2010-12-17","10/11","09/10","08/09",null,"2010-12-17","10/11","09/10","08/09"]
[null,null,null,null,null,null,null,"2010-12-18","10/11","09/10","08/09",null,"2010-12-18","10/11","09/10","08/09"]
[null,null,null,null,null,null,null,"2010-12-19","10/11","09/10","08/09",null,"2010-12-19","10/11","09/10","08/09"]
[null,null,null,null,null,null,null,"2010-12-20","10/11","09/10","08/09",null,"2010-12-20","10/11","09/10","08/09"]
[null,null,null,null,null,null,null,"2010-12-21","10/11","09/10","08/09",null,"2010-12-21","10/11","09/10","08/09"]
[null,null,null,null,null,null,null,"2010-12-22","10/11","09/10","08/09",null,"2010-12-22","10/11","09/10","08/09"]
[null,null,null,null,null,null,null,"2010-12-23","10/11","09/10","08/09",null,"2010-12-23","10/11","09/10","08/09"]
[null,null,null,null,null,null,null,"2010-12-24","10/11","09/10","08/09",null,"2010-12-24","10/11","09/10","08/09"]
[null,null,null,null,null,null,null,"2010-12-25","10/11","09/10","08/09",null,"2010-12-25","10/11","09/10","08/09"]
[null,null,null,null,null,null,null,"2010-12-26","10/11","09/10","08/09",null,"2010-12-26","10/11","09/10","08/09"]
[null,null,null,null,null,null,null,"2010-12-27","10/11","09/10","08/09",null,"2010-12-27","10/11","09/10","08/09"]
[null,null,null,null,null,null,null,"2010-12-28","10/11","09/10","08/09",null,"2010-12-28","10/11","09/10","08/09"]
[null,null,null,null,null,null,null,"2010-12-29","10/11","09/10","08/09",null,"2010-12-29","10/11","09/10","08/09"]
[null,null,null,null,null,null,null,"2010-12-30","10/11","09/10","08/09",null,"2010-12-30","10/11","09/10","08/09"]
[null,null,null,null,null,null,null,"2010-12-31","10/11","09/10","08/09",null,"2010-12-31","10/11","09/10","08/09"]
[null,null,null,null,null,null,null,"2011-01-01","10/11","09/10","08/09",null,"2011-01-01","10/11","09/10","08/09"]
[null,null,null,null,null,null,null,"2011-01-02","10/11","09/10","08/09",null,"2011-01-02","10/11","09/10","08/09"]
[null,null,null,null,null,null,null,"2011-01-03","10/11","09/10","08/09",null,"2011-01-03","10/11","09/10","08/09"]
[null,null,null,null,null,null,null,"2011-01-04","10/11","09/10","08/09",null,"2011-01-04","10/11","09/10","08/09"]
[null,null,null,null,null,null,null,"2011-01-05","10/11","09/10","08/09",null,"2011-01-05","10/11","09/10","08/09"]
[null,null,null,null,null,null,null,"2011-01-06","10/11","09/10","08/09",null,"2011-01-06","10/11","09/10","08/09"]
[null,null,null,null,null,null,null,"2011-01-07","10/11","09/10","08/09",null,"2011-01-07","10/11","09/10","08/09"]
[null,null,null,null,null,null,null,"2011-01-08","10/11","09/10","08/09",null,"2011-01-08","10/11","09/10","08/09"]
[null,null,null,null,null,null,null,"2011-01-09","10/11","09/10","08/09",null,"2011-01-09","10/11","09/10","08/09"]
[null,null,null,null,null,null,null,"2011-01-10","10/11","09/10","08/09",null,"2011-01-10","10/11","09/10","08/09"]
[null,null,null,null,null,null,null,"2011-01-11","10/11","09/10","08/09",null,"2011-01-11","10/11","09/10","08/09"]
[null,null,null,null,null,null,null,"2011-01-12","10/11","09/10","08/09",null,"2011-01-12","10/11","09/10","08/09"]
[null,null,null,null,null,null,null,"2011-01-13","10/11","09/10","08/09",null,"2011-01-13","10/11","09/10","08/09"]
[null,null,null,null,null,null,null,"2011-01-14","10/11","09/10","08/09",null,"2011-01-14","10/11","09/10","08/09"]
[null,null,null,null,null,null,null,"2011-01-15","10/11","09/10","08/09",null,"2011-01-15","10/11","09/10","08/09"]
[null,null,null,null,null,null,null,"2011-01-16","10/11","09/10","08/09",null,"2011-01-16","10/11","09/10","08/09"]
[null,null,null,null,null,null,null,"2011-01-17","10/11","09/10","08/09",null,"2011-01-17","10/11","09/10","08/09"]
[null,null,null,null,null,null,null,"2011-01-18","10/11","09/10","08/09",null,"2011-01-18","10/11","09/10","08/09"]
[null,null,null,null,null,null,null,"2011-01-19","10/11","09/10","08/09",null,"2011-01-19","10/11","09/10","08/09"]
[null,null,null,null,null,null,null,"2011-01-20","10/11","09/10","08/09",null,"2011-01-20","10/11","09/10","08/09"]
[null,null,null,null,null,null,null,"2011-01-21","10/11","09/10","08/09",null,"2011-01-21","10/11","09/10","08/09"]
[null,null,null,null,null,null,null,"2011-01-22","10/11","09/10","08/09",null,"2011-01-22","10/11","09/10","08/09"]
[null,null,null,null,null,null,null,"2011-01-23","10/11","09/10","08/09",null,"2011-01-23","10/11","09/10","08/09"]
[null,null,null,null,null,null,null,"2011-01-24","10/11","09/10","08/09",null,"2011-01-24","10/11","09/10","08/09"]
[null,null,null,null,null,null,null,"2011-01-25","10/11","09/10","08/09",null,"2011-01-25","10/11","09/10","08/09"]
[null,null,null,null,null,null,null,"2011-01-26","10/11","09/10","08/09",null,"2011-01-26","10/11","09/10","08/09"]
[null,null,null,null,null,null,null,"2011-01-27","10/11","09/10","08/09",null,"2011-01-27","10/11","09/10","08/09"]
[null,null,null,null,null,null,null,"2011-01-28","10/11","09/10","08/09",null,"2011-01-28","10/11","09/10","08/09"]
[null,null,null,null,null,null,null,"2011-01-29","10/11","09/10","08/09",null,"2011-01-29","10/11","09/10","08/09"]
[null,null,null,null,null,null,null,"2011-01-30","10/11","09/10","08/09",null,"2011-01-30","10/11","09/10","08/09"]
[null,null,null,null,null,null,null,"2011-01-31","10/11","09/10","08/09",null,"2011-01-31","10/11","09/10","08/09"]
[null,null,null,null,null,null,null,"2011-02-01","10/11","09/10","08/09",null,"2011-02-01","10/11","09/10","08/09"]
[null,null,null,null,null,null,null,"2011-02-02","10/11","09/10","08/09",null,"2011-02-02","10/11","09/10","08/09"]
[null,null,null,null,null,null,null,"2011-02-03","10/11","09/10","08/09",null,"2011-02-03","10/11","09/10","08/09"]
[null,null,null,null,null,null,null,"2011-02-04","10/11","09/10","08/09",null,"2011-02-04","10/11","09/10","08/09"]
[null,null,null,null,null,null,null,"2011-02-05","10/11","09/10","08/09",null,"2011-02-05","10/11","09/10","08/09"]
[null,null,null,null,null,null,null,"2011-02-06","10/11","09/10","08/09",null,"2011-02-06","10/11","09/10","08/09"]
[null,null,null,null,null,null,null,"2011-02-07","10/11","09/10","08/09",null,"2011-02-07","10/11","09/10","08/09"]
[null,null,null,null,null,null,null,"2011-02-08","10/11","09/10","08/09",null,"2011-02-08","10/11","09/10","08/09"]
[null,null,null,null,null,null,null,"2011-02-09","10/11","09/10","08/09",null,"2011-02-09","10/11","09/10","08/09"]
[null,null,null,null,null,null,null,"2011-02-10","10/11","09/10","08/09",null,"2011-02-10","10/11","09/10","08/09"]
[null,null,null,null,null,null,null,"2011-02-11","10/11","09/10","08/09",null,"2011-02-11","10/11","09/10","08/09"]
[null,null,null,null,null,null,null,"2011-02-12","10/11","09/10","08/09",null,"2011-02-12","10/11","09/10","08/09"]
[null,null,null,null,null,null,null,"2011-02-13","10/11","09/10","08/09",null,"2011-02-13","10/11","09/10","08/09"]
[null,null,null,null,null,null,null,"2011-02-14","10/11","09/10","08/09",null,"2011-02-14","10/11","09/10","08/09"]
[null,null,null,null,null,null,null,"2011-02-15","10/11","09/10","08/09",null,"2011-02-15","10/11","09/10","08/09"]
[null,null,null,null,null,null,null,"2011-02-16","10/11","09/10","08/09",null,"2011-02-16","10/11","09/10","08/09"]
[null,null,null,null,null,null,null,"2011-02-17","10/11","09/10","08/09",null,"2011-02-17","10/11","09/10","08/09"]
[null,null,null,null,null,null,null,"2011-02-18","10/11","09/10","08/09",null,"2011-02-18","10/11","09/10","08/09"]
[null,null,null,null,null,null,null,"2011-02-19","10/11","09/10","08/09",null,"2011-02-19","10/11","09/10","08/09"]
[null,null,null,null,null,null,null,"2011-02-20","10/11","09/10","08/09",null,"2011-02-20","10/11","09/10","08/09"]
[null,null,null,null,null,null,null,"2011-02-21","10/11","09/10","08/09",null,"2011-02-21","10/11","09/10","08/09"]
[null,null,null,null,null,null,null,"2011-02-22","10/11","09/10","08/09",null,"2011-02-22","10/11","09/10","08/09"]
[null,null,null,null,null,null,null,"2011-02-23","10/11","09/10","08/09",null,"2011-02-23","10/11","09/10","08/09"]
[null,null,null,null,null,null,null,"2011-02-24","10/11","09/10","08/09",null,"2011-02-24","10/11","09/10","08/09"]
[null,null,null,null,null,null,null,"2011-02-25","10/11","09/10","08/09",null,"2011-02-25","10/11","09/10","08/09"]
[null,null,null,null,null,null,null,"2011-02-26","10/11","09/10","08/09",null,"2011-02-26","10/11","09/10","08/09"]
[null,null,null,null,null,null,null,"2011-02-27","10/11","09/10","08/09",null,"2011-02-27","10/11","09/10","08/09"]
[null,null,null,null,null,null,null,"2011-02-28","10/11","09/10","08/09",null,"2011-02-28","10/11","09/10","08/09"]
[null,null,null,null,null,null,null,"2011-03-01","10/11","09/10","08/09",null,"2011-03-01","10/11","09/10","08/09"]
[null,null,null,null,null,null,null,"2011-03-02","10/11","09/10","08/09",null,"2011-03-02","10/11","09/10","08/09"]
[null,null,null,null,null,null,null,"2011-03-03","10/11","09/10","08/09",null,"2011-03-03","10/11","09/10","08/09"]
[null,null,null,null,null,null,null,"2011-03-04","10/11","09/10","08/09",null,"2011-03-04","10/11","09/10","08/09"]
[null,null,null,null,null,null,null,"2011-03-05","10/11","09/10","08/09",null,"2011-03-05","10/11","09/10","08/09"]
[null,null,null,null,null,null,null,"2011-03-06","10/11","09/10","08/09",null,"2011-03-06","10/11","09/10","08/09"]
[null,null,null,null,null,null,null,"2011-03-07","10/11","09/10","08/09",null,"2011-03-07","10/11","09/10","08/09"]
[null,null,null,null,null,null,null,"2011-03-08","10/11","09/10","08/09",null,"2011-03-08","10/11","09/10","08/09"]
[null,null,null,null,null,null,null,"2011-03-09","10/11","09/10","08/09",null,"2011-03-09","10/11","09/10","08/09"]
[null,null,null,null,null,null,null,"2011-03-10","10/11","09/10","08/09",null,"2011-03-10","10/11","09/10","08/09"]
[null,null,null,null,null,null,null,"2011-03-11","10/11","09/10","08/09",null,"2011-03-11","10/11","09/10","08/09"]
[null,null,null,null,null,null,null,"2011-03-12","10/11","09/10","08/09",null,"2011-03-12","10/11","09/10","08/09"]
[null,null,null,null,null,null,null,"2011-03-13","10/11","09/10","08/09",null,"2011-03-13","10/11","09/10","08/09"]
[null,null,null,null,null,null,null,"2011-03-14","10/11","09/10","08/09",null,"2011-03-14","10/11","09/10","08/09"]
[null,null,null,null,null,null,null,"2011-03-15","10/11","09/10","08/09",null,"2011-03-15","10/11","09/10","08/09"]
[null,null,null,null,null,null,null,"2011-03-16","10/11","09/10","08/09",null,"2011-03-16","10/11","09/10","08/09"]
[null,null,null,null,null,null,null,"2011-03-17","10/11","09/10","08/09",null,"2011-03-17","10/11","09/10","08/09"]
[null,null,null,null,null,null,null,"2011-03-18","10/11","09/10","08/09",null,"2011-03-18","10/11","09/10","08/09"]
[null,null,null,null,null,null,null,"2011-03-19","10/11","09/10","08/09",null,"2011-03-19","10/11","09/10","08/09"]
[null,null,null,null,null,null,null,"2011-03-20","10/11","09/10","08/09",null,"2011-03-20","10/11","09/10","08/09"]
[null,null,null,null,null,null,null,"2011-03-21","10/11","09/10","08/09",null,"2011-03-21","10/11","09/10","08/09"]
[null,null,null,null,null,null,null,"2011-03-22","10/11","09/10","08/09",null,"2011-03-22","10/11","09/10","08/09"]
[null,null,null,null,null,null,null,"2011-03-23","10/11","09/10","08/09",null,"2011-03-23","10/11","09/10","08/09"]
[null,null,null,null,null,null,null,"2011-03-24","10/11","09/10","08/09",null,"2011-03-24","10/11","09/10","08/09"]
[null,null,null,null,null,null,null,"2011-03-25","10/11","09/10","08/09",null,"2011-03-25","10/11","09/10","08/09"]
[null,null,null,null,null,null,null,"2011-03-26","10/11","09/10","08/09",null,"2011-03-26","10/11","09/10","08/09"]
[null,null,null,null,null,null,null,"2011-03-27","10/11","09/10","08/09",null,"2011-03-27","10/11","09/10","08/09"]
[null,null,null,null,null,null,null,"2011-03-28","10/11","09/10","08/09",null,"2011-03-28","10/11","09/10","08/09"]
[null,null,null,null,null,null,null,"2011-03-29","10/11","09/10","08/09",null,"2011-03-29","10/11","09/10","08/09"]
[null,null,null,null,null,null,null,"2011-03-30","10/11","09/10","08/09",null,"2011-03-30","10/11","09/10","08/09"]
[null,null,null,null,null,null,null,"2011-03-31","10/11","09/10","08/09",null,"2011-03-31","10/11","09/10","08/09"]
[null,null,null,null,null,null,null,"2011-04-01","10/11","09/10","08/09",null,"2011-04-01","10/11","09/10","08/09"]
[null,null,null,null,null,null,null,"2011-04-02","10/11","09/10","08/09",null,"2011-04-02","10/11","09/10","08/09"]
[null,null,null,null,null,null,null,"2011-04-03","10/11","09/10","08/09",null,"2011-04-03","10/11","09/10","08/09"]
[null,null,null,null,null,null,null,"2011-04-04","10/11","09/10","08/09",null,"2011-04-04","10/11","09/10","08/09"]
[null,null,null,null,null,null,null,"2011-04-05","10/11","09/10","08/09",null,"2011-04-05","10/11","09/10","08/09"]
[null,null,null,null,null,null,null,"2011-04-06","11/12","10/11","09/10",null,"2011-04-06","11/12","10/11","09/10"]
[null,null,null,null,null,null,null,"2011-04-07","11/12","10/11","09/10",null,"2011-04-07","11/12","10/11","09/10"]
[null,null,null,null,null,null,null,"2011-04-08","11/12","10/11","09/10",null,"2011-04-08","11/12","10/11","09/10"]
[null,null,null,null,null,null,null,"2011-04-09","11/12","10/11","09/10",null,"2011-04-09","11/12","10/11","09/10"]
[null,null,null,null,null,null,null,"2011-04-10","11/12","10/11","09/10",null,"2011-04-10","11/12","10/11","09/10"]
[null,null,null,null,null,null,null,"2011-04-11","11/12","10/11","09/10",null,"2011-04-11","11/12","10/11","09/10"]
[null,null,null,null,null,null,null,"2011-04-12","11/12","10/11","09/10",null,"2011-04-12","11/12","10/11","09/10"]
[null,null,null,null,null,null,null,"2011-04-13","11/12","10/11","09/10",null,"2011-04-13","11/12","10/11","09/10"]
[null,null,null,null,null,null,null,"2011-04-14","11/12","10/11","09/10",null,"2011-04-14","11/12","10/11","09/10"]
[null,null,null,null,null,null,null,"2011-04-15","11/12","10/11","09/10",null,"2011-04-15","11/12","10/11","09/10"]
[null,null,null,null,null,null,null,"2011-04-16","11/12","10/11","09/10",null,"2011-04-16","11/12","10/11","09/10"]
[null,null,null,null,null,null,null,"2011-04-17","11/12","10/11","09/10",null,"2011-04-17","11/12","10/11","09/10"]
[null,null,null,null,null,null,null,"2011-04-18","11/12","10/11","09/10",null,"2011-04-18","11/12","10/11","09/10"]
[null,null,null,null,null,null,null,"2011-04-19","11/12","10/11","09/10",null,"2011-04-19","11/12","10/11","09/10"]
[null,null,null,null,null,null,null,"2011-04-20","11/12","10/11","09/10",null,"2011-04-20","11/12","10/11","09/10"]
[null,null,null,null,null,null,null,"2011-04-21","11/12","10/11","09/10",null,"2011-04-21","11/12","10/11","09/10"]
[null,null,null,null,null,null,null,"2011-04-22","11/12","10/11","09/10",null,"2011-04-22","11/12","10/11","09/10"]
[null,null,null,null,null,null,null,"2011-04-23","11/12","10/11","09/10",null,"2011-04-23","11/12","10/11","09/10"]
[null,null,null,null,null,null,null,"2011-04-24","11/12","10/11","09/10",null,"2011-04-24","11/12","10/11","09/10"]
[null,null,null,null,null,null,null,"2011-04-25","11/12","10/11","09/10",null,"2011-04-25","11/12","10/11","09/10"]
[null,null,null,null,null,null,null,"2011-04-26","11/12","10/11","09/10",null,"2011-04-26","11/12","10/11","09/10"]
[null,null,null,null,null,null,null,"2011-04-27","11/12","10/11","09/10",null,"2011-04-27","11/12","10/11","09/10"]
[null,null,null,null,null,null,null,"2011-04-28","11/12","10/11","09/10",null,"2011-04-28","11/12","10/11","09/10"]
[null,null,null,null,null,null,null,"2011-04-29","11/12","10/11","09/10",null,"2011-04-29","11/12","10/11","09/10"]
[null,null,null,null,null,null,null,"2011-04-30","11/12","10/11","09/10",null,"2011-04-30","11/12","10/11","09/10"]
[null,null,null,null,null,null,null,"2011-05-01","11/12","10/11","09/10",null,"2011-05-01","11/12","10/11","09/10"]
[null,null,null,null,null,null,null,"2011-05-02","11/12","10/11","09/10",null,"2011-05-02","11/12","10/11","09/10"]
[null,null,null,null,null,null,null,"2011-05-03","11/12","10/11","09/10",null,"2011-05-03","11/12","10/11","09/10"]
[null,null,null,null,null,null,null,"2011-05-04","11/12","10/11","09/10",null,"2011-05-04","11/12","10/11","09/10"]
[null,null,null,null,null,null,null,"2011-05-05","11/12","10/11","09/10",null,"2011-05-05","11/12","10/11","09/10"]
[null,null,null,null,null,null,null,"2011-05-06","11/12","10/11","09/10",null,"2011-05-06","11/12","10/11","09/10"]
[null,null,null,null,null,null,null,"2011-05-07","11/12","10/11","09/10",null,"2011-05-07","11/12","10/11","09/10"]
[null,null,null,null,null,null,null,"2011-05-08","11/12","10/11","09/10",null,"2011-05-08","11/12","10/11","09/10"]
[null,null,null,null,null,null,null,"2011-05-09","11/12","10/11","09/10",null,"2011-05-09","11/12","10/11","09/10"]
[null,null,null,null,null,null,null,"2011-05-10","11/12","10/11","09/10",null,"2011-05-10","11/12","10/11","09/10"]
[null,null,null,null,null,null,null,"2011-05-11","11/12","10/11","09/10",null,"2011-05-11","11/12","10/11","09/10"]
[null,null,null,null,null,null,null,"2011-05-12","11/12","10/11","09/10",null,"2011-05-12","11/12","10/11","09/10"]
[null,null,null,null,null,null,null,"2011-05-13","11/12","10/11","09/10",null,"2011-05-13","11/12","10/11","09/10"]
[null,null,null,null,null,null,null,"2011-05-14","11/12","10/11","09/10",null,"2011-05-14","11/12","10/11","09/10"]
[null,null,null,null,null,null,null,"2011-05-15","11/12","10/11","09/10",null,"2011-05-15","11/12","10/11","09/10"]
[null,null,null,null,null,null,null,"2011-05-16","11/12","10/11","09/10",null,"2011-05-16","11/12","10/11","09/10"]
[null,null,null,null,null,null,null,"2011-05-17","11/12","10/11","09/10",null,"2011-05-17","11/12","10/11","09/10"]
[null,null,null,null,null,null,null,"2011-05-18","11/12","10/11","09/10",null,"2011-05-18","11/12","10/11","09/10"]
[null,null,null,null,null,null,null,"2011-05-19","11/12","10/11","09/10",null,"2011-05-19","11/12","10/11","09/10"]
[null,null,null,null,null,null,null,"2011-05-20","11/12","10/11","09/10",null,"2011-05-20","11/12","10/11","09/10"]
[null,null,null,null,null,null,null,"2011-05-21","11/12","10/11","09/10",null,"2011-05-21","11/12","10/11","09/10"]
[null,null,null,null,null,null,null,"2011-05-22","11/12","10/11","09/10",null,"2011-05-22","11/12","10/11","09/10"]
[null,null,null,null,null,null,null,"2011-05-23","11/12","10/11","09/10",null,"2011-05-23","11/12","10/11","09/10"]
[null,null,null,null,null,null,null,"2011-05-24","11/12","10/11","09/10",null,"2011-05-24","11/12","10/11","09/10"]
[null,null,null,null,null,null,null,"2011-05-25","11/12","10/11","09/10",null,"2011-05-25","11/12","10/11","09/10"]
[null,null,null,null,null,null,null,"2011-05-26","11/12","10/11","09/10",null,"2011-05-26","11/12","10/11","09/10"]
[null,null,null,null,null,null,null,"2011-05-27","11/12","10/11","09/10",null,"2011-05-27","11/12","10/11","09/10"]
[null,null,null,null,null,null,null,"2011-05-28","11/12","10/11","09/10",null,"2011-05-28","11/12","10/11","09/10"]
[null,null,null,null,null,null,null,"2011-05-29","11/12","10/11","09/10",null,"2011-05-29","11/12","10/11","09/10"]
[null,null,null,null,null,null,null,"2011-05-30","11/12","10/11","09/10",null,"2011-05-30","11/12","10/11","09/10"]
[null,null,null,null,null,null,null,"2011-05-31","11/12","10/11","09/10",null,"2011-05-31","11/12","10/11","09/10"]
[null,null,null,null,null,null,null,"2011-06-01","11/12","10/11","09/10",null,"2011-06-01","11/12","10/11","09/10"]
[null,null,null,null,null,null,null,"2011-06-02","11/12","10/11","09/10",null,"2011-06-02","11/12","10/11","09/10"]
[null,null,null,null,null,null,null,"2011-06-03","11/12","10/11","09/10",null,"2011-06-03","11/12","10/11","09/10"]
[null,null,null,null,null,null,null,"2011-06-04","11/12","10/11","09/10",null,"2011-06-04","11/12","10/11","09/10"]
[null,null,null,null,null,null,null,"2011-06-05","11/12","10/11","09/10",null,"2011-06-05","11/12","10/11","09/10"]
[null,null,null,null,null,null,null,"2011-06-06","11/12","10/11","09/10",null,"2011-06-06","11/12","10/11","09/10"]
[null,null,null,null,null,null,null,"2011-06-07","11/12","10/11","09/10",null,"2011-06-07","11/12","10/11","09/10"]
[null,null,null,null,null,null,null,"2011-06-08","11/12","10/11","09/10",null,"2011-06-08","11/12","10/11","09/10"]
[null,null,null,null,null,null,null,"2011-06-09","11/12","10/11","09/10",null,"2011-06-09","11/12","10/11","09/10"]
[null,null,null,null,null,null,null,"2011-06-10","11/12","10/11","09/10",null,"2011-06-10","11/12","10/11","09/10"]
[null,null,null,null,null,null,null,"2011-06-11","11/12","10/11","09/10",null,"2011-06-11","11/12","10/11","09/10"]
[null,null,null,null,null,null,null,"2011-06-12","11/12","10/11","09/10",null,"2011-06-12","11/12","10/11","09/10"]
[null,null,null,null,null,null,null,"2011-06-13","11/12","10/11","09/10",null,"2011-06-13","11/12","10/11","09/10"]
[null,null,null,null,null,null,null,"2011-06-14","11/12","10/11","09/10",null,"2011-06-14","11/12","10/11","09/10"]
[null,null,null,null,null,null,null,"2011-06-15","11/12","10/11","09/10",null,"2011-06-15","11/12","10/11","09/10"]
[null,null,null,null,null,null,null,"2011-06-16","11/12","10/11","09/10",null,"2011-06-16","11/12","10/11","09/10"]
[null,null,null,null,null,null,null,"2011-06-17","11/12","10/11","09/10",null,"2011-06-17","11/12","10/11","09/10"]
[null,null,null,null,null,null,null,"2011-06-18","11/12","10/11","09/10",null,"2011-06-18","11/12","10/11","09/10"]
[null,null,null,null,null,null,null,"2011-06-19","11/12","10/11","09/10",null,"2011-06-19","11/12","10/11","09/10"]
[null,null,null,null,null,null,null,"2011-06-20","11/12","10/11","09/10",null,"2011-06-20","11/12","10/11","09/10"]
[null,null,null,null,null,null,null,"2011-06-21","11/12","10/11","09/10",null,"2011-06-21","11/12","10/11","09/10"]
[null,null,null,null,null,null,null,"2011-06-22","11/12","10/11","09/10",null,"2011-06-22","11/12","10/11","09/10"]
[null,null,null,null,null,null,null,"2011-06-23","11/12","10/11","09/10",null,"2011-06-23","11/12","10/11","09/10"]
[null,null,null,null,null,null,null,"2011-06-24","11/12","10/11","09/10",null,"2011-06-24","11/12","10/11","09/10"]
[null,null,null,null,null,null,null,"2011-06-25","11/12","10/11","09/10",null,"2011-06-25","11/12","10/11","09/10"]
[null,null,null,null,null,null,null,"2011-06-26","11/12","10/11","09/10",null,"2011-06-26","11/12","10/11","09/10"]
[null,null,null,null,null,null,null,"2011-06-27","11/12","10/11","09/10",null,"2011-06-27","11/12","10/11","09/10"]
[null,null,null,null,null,null,null,"2011-06-28","11/12","10/11","09/10",null,"2011-06-28","11/12","10/11","09/10"]
[null,null,null,null,null,null,null,"2011-06-29","11/12","10/11","09/10",null,"2011-06-29","11/12","10/11","09/10"]
[null,null,null,null,null,null,null,"2011-06-30","11/12","10/11","09/10",null,"2011-06-30","11/12","10/11","09/10"]
[null,null,null,null,null,null,null,"2011-07-01","11/12","10/11","09/10",null,"2011-07-01","11/12","10/11","09/10"]
[null,null,null,null,null,null,null,"2011-07-02","11/12","10/11","09/10",null,"2011-07-02","11/12","10/11","09/10"]
[null,null,null,null,null,null,null,"2011-07-03","11/12","10/11","09/10",null,"2011-07-03","11/12","10/11","09/10"]
[null,null,null,null,null,null,null,"2011-07-04","11/12","10/11","09/10",null,"2011-07-04","11/12","10/11","09/10"]
[null,null,null,null,null,null,null,"2011-07-05","11/12","10/11","09/10",null,"2011-07-05","11/12","10/11","09/10"]
[null,null,null,null,null,null,null,"2011-07-06","11/12","10/11","09/10",null,"2011-07-06","11/12","10/11","09/10"]
[null,null,null,null,null,null,null,"2011-07-07","11/12","10/11","09/10",null,"2011-07-07","11/12","10/11","09/10"]
[null,null,null,null,null,null,null,"2011-07-08","11/12","10/11","09/10",null,"2011-07-08","11/12","10/11","09/10"]
[null,null,null,null,null,null,null,"2011-07-09","11/12","10/11","09/10",null,"2011-07-09","11/12","10/11","09/10"]
[null,null,null,null,null,null,null,"2011-07-10","11/12","10/11","09/10",null,"2011-07-10","11/12","10/11","09/10"]
[null,null,null,null,null,null,null,"2011-07-11","11/12","10/11","09/10",null,"2011-07-11","11/12","10/11","09/10"]
[null,null,null,null,null,null,null,"2011-07-12","11/12","10/11","09/10",null,"2011-07-12","11/12","10/11","09/10"]
[null,null,null,null,null,null,null,"2011-07-13","11/12","10/11","09/10",null,"2011-07-13","11/12","10/11","09/10"]
[null,null,null,null,null,null,null,"2011-07-14","11/12","10/11","09/10",null,"2011-07-14","11/12","10/11","09/10"]
[null,null,null,null,null,null,null,"2011-07-15","11/12","10/11","09/10",null,"2011-07-15","11/12","10/11","09/10"]
[null,null,null,null,null,null,null,"2011-07-16","11/12","10/11","09/10",null,"2011-07-16","11/12","10/11","09/10"]
[null,null,null,null,null,null,null,"2011-07-17","11/12","10/11","09/10",null,"2011-07-17","11/12","10/11","09/10"]
[null,null,null,null,null,null,null,"2011-07-18","11/12","10/11","09/10",null,"2011-07-18","11/12","10/11","09/10"]
[null,null,null,null,null,null,null,"2011-07-19","11/12","10/11","09/10",null,"2011-07-19","11/12","10/11","09/10"]
[null,null,null,null,null,null,null,"2011-07-20","11/12","10/11","09/10",null,"2011-07-20","11/12","10/11","09/10"]
[null,null,null,null,null,null,null,"2011-07-21","11/12","10/11","09/10",null,"2011-07-21","11/12","10/11","09/10"]
[null,null,null,null,null,null,null,"2011-07-22","11/12","10/11","09/10",null,"2011-07-22","11/12","10/11","09/10"]
[null,null,null,null,null,null,null,"2011-07-23","11/12","10/11","09/10",null,"2011-07-23","11/12","10/11","09/10"]
[null,null,null,null,null,null,null,"2011-07-24","11/12","10/11","09/10",null,"2011-07-24","11/12","10/11","09/10"]
[null,null,null,null,null,null,null,"2011-07-25","11/12","10/11","09/10",null,"2011-07-25","11/12","10/11","09/10"]
[null,null,null,null,null,null,null,"2011-07-26","11/12","10/11","09/10",null,"2011-07-26","11/12","10/11","09/10"]
[null,null,null,null,null,null,null,"2011-07-27","11/12","10/11","09/10",null,"2011-07-27","11/12","10/11","09/10"]
[null,null,null,null,null,null,null,"2011-07-28","11/12","10/11","09/10",null,"2011-07-28","11/12","10/11","09/10"]
[null,null,null,null,null,null,null,"2011-07-29","11/12","10/11","09/10",null,"2011-07-29","11/12","10/11","09/10"]
[null,null,null,null,null,null,null,"2011-07-30","11/12","10/11","09/10",null,"2011-07-30","11/12","10/11","09/10"]
[null,null,null,null,null,null,null,"2011-07-31","11/12","10/11","09/10",null,"2011-07-31","11/12","10/11","09/10"]
[null,null,null,null,null,null,null,"2011-08-01","11/12","10/11","09/10",null,"2011-08-01","11/12","10/11","09/10"]
[null,null,null,null,null,null,null,"2011-08-02","11/12","10/11","09/10",null,"2011-08-02","11/12","10/11","09/10"]
[null,null,null,null,null,null,null,"2011-08-03","11/12","10/11","09/10",null,"2011-08-03","11/12","10/11","09/10"]
[null,null,null,null,null,null,null,"2011-08-04","11/12","10/11","09/10",null,"2011-08-04","11/12","10/11","09/10"]
[null,null,null,null,null,null,null,"2011-08-05","11/12","10/11","09/10",null,"2011-08-05","11/12","10/11","09/10"]
[null,null,null,null,null,null,null,"2011-08-06","11/12","10/11","09/10",null,"2011-08-06","11/12","10/11","09/10"]
[null,null,null,null,null,null,null,"2011-08-07","11/12","10/11","09/10",null,"2011-08-07","11/12","10/11","09/10"]
[null,null,null,null,null,null,null,"2011-08-08","11/12","10/11","09/10",null,"2011-08-08","11/12","10/11","09/10"]
[null,null,null,null,null,null,null,"2011-08-09","11/12","10/11","09/10",null,"2011-08-09","11/12","10/11","09/10"]
[null,null,null,null,null,null,null,"2011-08-10","11/12","10/11","09/10",null,"2011-08-10","11/12","10/11","09/10"]
[null,null,null,null,null,null,null,"2011-08-11","11/12","10/11","09/10",null,"2011-08-11","11/12","10/11","09/10"]
[null,null,null,null,null,null,null,"2011-08-12","11/12","10/11","09/10",null,"2011-08-12","11/12","10/11","09/10"]
[null,null,null,null,null,null,null,"2011-08-13","11/12","10/11","09/10",null,"2011-08-13","11/12","10/11","09/10"]
[null,null,null,null,null,null,null,"2011-08-14","11/12","10/11","09/10",null,"2011-08-14","11/12","10/11","09/10"]
[null,null,null,null,null,null,null,"2011-08-15","11/12","10/11","09/10",null,"2011-08-15","11/12","10/11","09/10"]
[null,null,null,null,null,null,null,"2011-08-16","11/12","10/11","09/10",null,"2011-08-16","11/12","10/11","09/10"]
[null,null,null,null,null,null,null,"2011-08-17","11/12","10/11","09/10",null,"2011-08-17","11/12","10/11","09/10"]
[null,null,null,null,null,null,null,"2011-08-18","11/12","10/11","09/10",null,"2011-08-18","11/12","10/11","09/10"]
[null,null,null,null,null,null,null,"2011-08-19","11/12","10/11","09/10",null,"2011-08-19","11/12","10/11","09/10"]
[null,null,null,null,null,null,null,"2011-08-20","11/12","10/11","09/10",null,"2011-08-20","11/12","10/11","09/10"]
[null,null,null,null,null,null,null,"2011-08-21","11/12","10/11","09/10",null,"2011-08-21","11/12","10/11","09/10"]
[null,null,null,null,null,null,null,"2011-08-22","11/12","10/11","09/10",null,"2011-08-22","11/12","10/11","09/10"]
[null,null,null,null,null,null,null,"2011-08-23","11/12","10/11","09/10",null,"2011-08-23","11/12","10/11","09/10"]
[null,null,null,null,null,null,null,"2011-08-24","11/12","10/11","09/10",null,"2011-08-24","11/12","10/11","09/10"]
[null,null,null,null,null,null,null,"2011-08-25","11/12","10/11","09/10",null,"2011-08-25","11/12","10/11","09/10"]
[null,null,null,null,null,null,null,"2011-08-26","11/12","10/11","09/10",null,"2011-08-26","11/12","10/11","09/10"]
[null,null,null,null,null,null,null,"2011-08-27","11/12","10/11","09/10",null,"2011-08-27","11/12","10/11","09/10"]
[null,null,null,null,null,null,null,"2011-08-28","11/12","10/11","09/10",null,"2011-08-28","11/12","10/11","09/10"]
[null,null,null,null,null,null,null,"2011-08-29","11/12","10/11","09/10",null,"2011-08-29","11/12","10/11","09/10"]
[null,null,null,null,null,null,null,"2011-08-30","11/12","10/11","09/10",null,"2011-08-30","11/12","10/11","09/10"]
[null,null,null,null,null,null,null,"2011-08-31","11/12","10/11","09/10",null,"2011-08-31","11/12","10/11","09/10"]
[null,null,null,null,null,null,null,"2011-09-01","11/12","10/11","09/10",null,"2011-09-01","11/12","10/11","09/10"]
[null,null,null,null,null,null,null,"2011-09-02","11/12","10/11","09/10",null,"2011-09-02","11/12","10/11","09/10"]
[null,null,null,null,null,null,null,"2011-09-03","11/12","10/11","09/10",null,"2011-09-03","11/12","10/11","09/10"]
[null,null,null,null,null,null,null,"2011-09-04","11/12","10/11","09/10",null,"2011-09-04","11/12","10/11","09/10"]
[null,null,null,null,null,null,null,"2011-09-05","11/12","10/11","09/10",null,"2011-09-05","11/12","10/11","09/10"]
[null,null,null,null,null,null,null,"2011-09-06","11/12","10/11","09/10",null,"2011-09-06","11/12","10/11","09/10"]
[null,null,null,null,null,null,null,"2011-09-07","11/12","10/11","09/10",null,"2011-09-07","11/12","10/11","09/10"]
[null,null,null,null,null,null,null,"2011-09-08","11/12","10/11","09/10",null,"2011-09-08","11/12","10/11","09/10"]
[null,null,null,null,null,null,null,"2011-09-09","11/12","10/11","09/10",null,"2011-09-09","11/12","10/11","09/10"]
[null,null,null,null,null,null,null,"2011-09-10","11/12","10/11","09/10",null,"2011-09-10","11/12","10/11","09/10"]
[null,null,null,null,null,null,null,"2011-09-11","11/12","10/11","09/10",null,"2011-09-11","11/12","10/11","09/10"]
[null,null,null,null,null,null,null,"2011-09-12","11/12","10/11","09/10",null,"2011-09-12","11/12","10/11","09/10"]
[null,null,null,null,null,null,null,"2011-09-13","11/12","10/11","09/10",null,"2011-09-13","11/12","10/11","09/10"]
[null,null,null,null,null,null,null,"2011-09-14","11/12","10/11","09/10",null,"2011-09-14","11/12","10/11","09/10"]
[null,null,null,null,null,null,null,"2011-09-15","11/12","10/11","09/10",null,"2011-09-15","11/12","10/11","09/10"]
[null,null,null,null,null,null,null,"2011-09-16","11/12","10/11","09/10",null,"2011-09-16","11/12","10/11","09/10"]
[null,null,null,null,null,null,null,"2011-09-17","11/12","10/11","09/10",null,"2011-09-17","11/12","10/11","09/10"]
[null,null,null,null,null,null,null,"2011-09-18","11/12","10/11","09/10",null,"2011-09-18","11/12","10/11","09/10"]
[null,null,null,null,null,null,null,"2011-09-19","11/12","10/11","09/10",null,"2011-09-19","11/12","10/11","09/10"]
[null,null,null,null,null,null,null,"2011-09-20","11/12","10/11","09/10",null,"2011-09-20","11/12","10/11","09/10"]
[null,null,null,null,null,null,null,"2011-09-21","11/12","10/11","09/10",null,"2011-09-21","11/12","10/11","09/10"]
[null,null,null,null,null,null,null,"2011-09-22","11/12","10/11","09/10",null,"2011-09-22","11/12","10/11","09/10"]
[null,null,null,null,null,null,null,"2011-09-23","11/12","10/11","09/10",null,"2011-09-23","11/12","10/11","09/10"]
[null,null,null,null,null,null,null,"2011-09-24","11/12","10/11","09/10",null,"2011-09-24","11/12","10/11","09/10"]
[null,null,null,null,null,null,null,"2011-09-25","11/12","10/11","09/10",null,"2011-09-25","11/12","10/11","09/10"]
[null,null,null,null,null,null,null,"2011-09-26","11/12","10/11","09/10",null,"2011-09-26","11/12","10/11","09/10"]
[null,null,null,null,null,null,null,"2011-09-27","11/12","10/11","09/10",null,"2011-09-27","11/12","10/11","09/10"]
[null,null,null,null,null,null,null,"2011-09-28","11/12","10/11","09/10",null,"2011-09-28","11/12","10/11","09/10"]
[null,null,null,null,null,null,null,"2011-09-29","11/12","10/11","09/10",null,"2011-09-29","11/12","10/11","09/10"]
[null,null,null,null,null,null,null,"2011-09-30","11/12","10/11","09/10",null,"2011-09-30","11/12","10/11","09/10"]
[null,null,null,null,null,null,null,"2011-10-01","11/12","10/11","09/10",null,"2011-10-01","11/12","10/11","09/10"]
[null,null,null,null,null,null,null,"2011-10-02","11/12","10/11","09/10",null,"2011-10-02","11/12","10/11","09/10"]
[null,null,null,null,null,null,null,"2011-10-03","11/12","10/11","09/10",null,"2011-10-03","11/12","10/11","09/10"]
[null,null,null,null,null,null,null,"2011-10-04","11/12","10/11","09/10",null,"2011-10-04","11/12","10/11","09/10"]
[null,null,null,null,null,null,null,"2011-10-05","11/12","10/11","09/10",null,"2011-10-05","11/12","10/11","09/10"]
[null,null,null,null,null,null,null,"2011-10-06","11/12","10/11","09/10",null,"2011-10-06","11/12","10/11","09/10"]
[null,null,null,null,null,null,null,"2011-10-07","11/12","10/11","09/10",null,"2011-10-07","11/12","10/11","09/10"]
[null,null,null,null,null,null,null,"2011-10-08","11/12","10/11","09/10",null,"2011-10-08","11/12","10/11","09/10"]
[null,null,null,null,null,null,null,"2011-10-09","11/12","10/11","09/10",null,"2011-10-09","11/12","10/11","09/10"]
[null,null,null,null,null,null,null,"2011-10-10","11/12","10/11","09/10",null,"2011-10-10","11/12","10/11","09/10"]
[null,null,null,null,null,null,null,"2011-10-11","11/12","10/11","09/10",null,"2011-10-11","11/12","10/11","09/10"]
[null,null,null,null,null,null,null,"2011-10-12","11/12","10/11","09/10",null,"2011-10-12","11/12","10/11","09/10"]
[null,null,null,null,null,null,null,"2011-10-13","11/12","10/11","09/10",null,"2011-10-13","11/12","10/11","09/10"]
[null,null,null,null,null,null,null,"2011-10-14","11/12","10/11","09/10",null,"2011-10-14","11/12","10/11","09/10"]
[null,null,null,null,null,null,null,"2011-10-15","11/12","10/11","09/10",null,"2011-10-15","11/12","10/11","09/10"]
[null,null,null,null,null,null,null,"2011-10-16","11/12","10/11","09/10",null,"2011-10-16","11/12","10/11","09/10"]
[null,null,null,null,null,null,null,"2011-10-17","11/12","10/11","09/10",null,"2011-10-17","11/12","10/11","09/10"]
[null,null,null,null,null,null,null,"2011-10-18","11/12","10/11","09/10",null,"2011-10-18","11/12","10/11","09/10"]
[null,null,null,null,null,null,null,"2011-10-19","11/12","10/11","09/10",null,"2011-10-19","11/12","10/11","09/10"]
[null,null,null,null,null,null,null,"2011-10-20","11/12","10/11","09/10",null,"2011-10-20","11/12","10/11","09/10"]
[null,null,null,null,null,null,null,"2011-10-21","11/12","10/11","09/10",null,"2011-10-21","11/12","10/11","09/10"]
[null,null,null,null,null,null,null,"2011-10-22","11/12","10/11","09/10",null,"2011-10-22","11/12","10/11","09/10"]
[null,null,null,null,null,null,null,"2011-10-23","11/12","10/11","09/10",null,"2011-10-23","11/12","10/11","09/10"]
[null,null,null,null,null,null,null,"2011-10-24","11/12","10/11","09/10",null,"2011-10-24","11/12","10/11","09/10"]
[null,null,null,null,null,null,null,"2011-10-25","11/12","10/11","09/10",null,"2011-10-25","11/12","10/11","09/10"]
[null,null,null,null,null,null,null,"2011-10-26","11/12","10/11","09/10",null,"2011-10-26","11/12","10/11","09/10"]
[null,null,null,null,null,null,null,"2011-10-27","11/12","10/11","09/10",null,"2011-10-27","11/12","10/11","09/10"]
[null,null,null,null,null,null,null,"2011-10-28","11/12","10/11","09/10",null,"2011-10-28","11/12","10/11","09/10"]
[null,null,null,null,null,null,null,"2011-10-29","11/12","10/11","09/10",null,"2011-10-29","11/12","10/11","09/10"]
[null,null,null,null,null,null,null,"2011-10-30","11/12","10/11","09/10",null,"2011-10-30","11/12","10/11","09/10"]
[null,null,null,null,null,null,null,"2011-10-31","11/12","10/11","09/10",null,"2011-10-31","11/12","10/11","09/10"]
[null,null,null,null,null,null,null,"2011-11-01","11/12","10/11","09/10",null,"2011-11-01","11/12","10/11","09/10"]
[null,null,null,null,null,null,null,"2011-11-02","11/12","10/11","09/10",null,"2011-11-02","11/12","10/11","09/10"]
[null,null,null,null,null,null,null,"2011-11-03","11/12","10/11","09/10",null,"2011-11-03","11/12","10/11","09/10"]
[null,null,null,null,null,null,null,"2011-11-04","11/12","10/11","09/10",null,"2011-11-04","11/12","10/11","09/10"]
[null,null,null,null,null,null,null,"2011-11-05","11/12","10/11","09/10",null,"2011-11-05","11/12","10/11","09/10"]
[null,null,null,null,null,null,null,"2011-11-06","11/12","10/11","09/10",null,"2011-11-06","11/12","10/11","09/10"]
[null,null,null,null,null,null,null,"2011-11-07","11/12","10/11","09/10",null,"2011-11-07","11/12","10/11","09/10"]
[null,null,null,null,null,null,null,"2011-11-08","11/12","10/11","09/10",null,"2011-11-08","11/12","10/11","09/10"]
[null,null,null,null,null,null,null,"2011-11-09","11/12","10/11","09/10",null,"2011-11-09","11/12","10/11","09/10"]
[null,null,null,null,null,null,null,"2011-11-10","11/12","10/11","09/10",null,"2011-11-10","11/12","10/11","09/10"]
[null,null,null,null,null,null,null,"2011-11-11","11/12","10/11","09/10",null,"2011-11-11","11/12","10/11","09/10"]
[null,null,null,null,null,null,null,"2011-11-12","11/12","10/11","09/10",null,"2011-11-12","11/12","10/11","09/10"]
[null,null,null,null,null,null,null,"2011-11-13","11/12","10/11","09/10",null,"2011-11-13","11/12","10/11","09/10"]
[null,null,null,null,null,null,null,"2011-11-14","11/12","10/11","09/10",null,"2011-11-14","11/12","10/11","09/10"]
[null,null,null,null,null,null,null,"2011-11-15","11/12","10/11","09/10",null,"2011-11-15","11/12","10/11","09/10"]
[null,null,null,null,null,null,null,"2011-11-16","11/12","10/11","09/10",null,"2011-11-16","11/12","10/11","09/10"]
[null,null,null,null,null,null,null,"2011-11-17","11/12","10/11","09/10",null,"2011-11-17","11/12","10/11","09/10"]
[null,null,null,null,null,null,null,"2011-11-18","11/12","10/11","09/10",null,"2011-11-18","11/12","10/11","09/10"]
[null,null,null,null,null,null,null,"2011-11-19","11/12","10/11","09/10",null,"2011-11-19","11/12","10/11","09/10"]
[null,null,null,null,null,null,null,"2011-11-20","11/12","10/11","09/10",null,"2011-11-20","11/12","10/11","09/10"]
[null,null,null,null,null,null,null,"2011-11-21","11/12","10/11","09/10",null,"2011-11-21","11/12","10/11","09/10"]
[null,null,null,null,null,null,null,"2011-11-22","11/12","10/11","09/10",null,"2011-11-22","11/12","10/11","09/10"]
[null,null,null,null,null,null,null,"2011-11-23","11/12","10/11","09/10",null,"2011-11-23","11/12","10/11","09/10"]
[null,null,null,null,null,null,null,"2011-11-24","11/12","10/11","09/10",null,"2011-11-24","11/12","10/11","09/10"]
[null,null,null,null,null,null,null,"2011-11-25","11/12","10/11","09/10",null,"2011-11-25","11/12","10/11","09/10"]
[null,null,null,null,null,null,null,"2011-11-26","11/12","10/11","09/10",null,"2011-11-26","11/12","10/11","09/10"]
[null,null,null,null,null,null,null,"2011-11-27","11/12","10/11","09/10",null,"2011-11-27","11/12","10/11","09/10"]
[null,null,null,null,null,null,null,"2011-11-28","11/12","10/11","09/10",null,"2011-11-28","11/12","10/11","09/10"]
[null,null,null,null,null,null,null,"2011-11-29","11/12","10/11","09/10",null,"2011-11-29","11/12","10/11","09/10"]
[null,null,null,null,null,null,null,"2011-11-30","11/12","10/11","09/10",null,"2011-11-30","11/12","10/11","09/10"]
[null,null,null,null,null,null,null,"2011-12-01","11/12","10/11","09/10",null,"2011-12-01","11/12","10/11","09/10"]
[null,null,null,null,null,null,null,"2011-12-02","11/12","10/11","09/10",null,"2011-12-02","11/12","10/11","09/10"]
[null,null,null,null,null,null,null,"2011-12-03","11/12","10/11","09/10",null,"2011-12-03","11/12","10/11","09/10"]
[null,null,null,null,null,null,null,"2011-12-04","11/12","10/11","09/10",null,"2011-12-04","11/12","10/11","09/10"]
[null,null,null,null,null,null,null,"2011-12-05","11/12","10/11","09/10",null,"2011-12-05","11/12","10/11","09/10"]
[null,null,null,null,null,null,null,"2011-12-06","11/12","10/11","09/10",null,"2011-12-06","11/12","10/11","09/10"]
[null,null,null,null,null,null,null,"2011-12-07","11/12","10/11","09/10",null,"2011-12-07","11/12","10/11","09/10"]
[null,null,null,null,null,null,null,"2011-12-08","11/12","10/11","09/10",null,"2011-12-08","11/12","10/11","09/10"]
[null,null,null,null,null,null,null,"2011-12-09","11/12","10/11","09/10",null,"2011-12-09","11/12","10/11","09/10"]
[null,null,null,null,null,null,null,"2011-12-10","11/12","10/11","09/10",null,"2011-12-10","11/12","10/11","09/10"]
[null,null,null,null,null,null,null,"2011-12-11","11/12","10/11","09/10",null,"2011-12-11","11/12","10/11","09/10"]
[null,null,null,null,null,null,null,"2011-12-12","11/12","10/11","09/10",null,"2011-12-12","11/12","10/11","09/10"]
[null,null,null,null,null,null,null,"2011-12-13","11/12","10/11","09/10",null,"2011-12-13","11/12","10/11","09/10"]
[null,null,null,null,null,null,null,"2011-12-14","11/12","10/11","09/10",null,"2011-12-14","11/12","10/11","09/10"]
[null,null,null,null,null,null,null,"2011-12-15","11/12","10/11","09/10",null,"2011-12-15","11/12","10/11","09/10"]
[null,null,null,null,null,null,null,"2011-12-16","11/12","10/11","09/10",null,"2011-12-16","11/12","10/11","09/10"]
[null,null,null,null,null,null,null,"2011-12-17","11/12","10/11","09/10",null,"2011-12-17","11/12","10/11","09/10"]
[null,null,null,null,null,null,null,"2011-12-18","11/12","10/11","09/10",null,"2011-12-18","11/12","10/11","09/10"]
[null,null,null,null,null,null,null,"2011-12-19","11/12","10/11","09/10",null,"2011-12-19","11/12","10/11","09/10"]
[null,null,null,null,null,null,null,"2011-12-20","11/12","10/11","09/10",null,"2011-12-20","11/12","10/11","09/10"]
[null,null,null,null,null,null,null,"2011-12-21","11/12","10/11","09/10",null,"2011-12-21","11/12","10/11","09/10"]
[null,null,null,null,null,null,null,"2011-12-22","11/12","10/11","09/10",null,"2011-12-22","11/12","10/11","09/10"]
[null,null,null,null,null,null,null,"2011-12-23","11/12","10/11","09/10",null,"2011-12-23","11/12","10/11","09/10"]
[null,null,null,null,null,null,null,"2011-12-24","11/12","10/11","09/10",null,"2011-12-24","11/12","10/11","09/10"]
[null,null,null,null,null,null,null,"2011-12-25","11/12","10/11","09/10",null,"2011-12-25","11/12","10/11","09/10"]
[null,null,null,null,null,null,null,"2011-12-26","11/12","10/11","09/10",null,"2011-12-26","11/12","10/11","09/10"]
[null,null,null,null,null,null,null,"2011-12-27","11/12","10/11","09/10",null,"2011-12-27","11/12","10/11","09/10"]
[null,null,null,null,null,null,null,"2011-12-28","11/12","10/11","09/10",null,"2011-12-28","11/12","10/11","09/10"]
[null,null,null,null,null,null,null,"2011-12-29","11/12","10/11","09/10",null,"2011-12-29","11/12","10/11","09/10"]
[null,null,null,null,null,null,null,"2011-12-30","11/12","10/11","09/10",null,"2011-12-30","11/12","10/11","09/10"]
[null,null,null,null,null,null,null,"2011-12-31","11/12","10/11","09/10",null,"2011-12-31","11/12","10/11","09/10"]
[null,null,null,null,null,null,null,"2012-01-01","11/12","10/11","09/10",null,"2012-01-01","11/12","10/11","09/10"]
[null,null,null,null,null,null,null,"2012-01-02","11/12","10/11","09/10",null,"2012-01-02","11/12","10/11","09/10"]
[null,null,null,null,null,null,null,"2012-01-03","11/12","10/11","09/10",null,"2012-01-03","11/12","10/11","09/10"]
[null,null,null,null,null,null,null,"2012-01-04","11/12","10/11","09/10",null,"2012-01-04","11/12","10/11","09/10"]
[null,null,null,null,null,null,null,"2012-01-05","11/12","10/11","09/10",null,"2012-01-05","11/12","10/11","09/10"]
[null,null,null,null,null,null,null,"2012-01-06","11/12","10/11","09/10",null,"2012-01-06","11/12","10/11","09/10"]
[null,null,null,null,null,null,null,"2012-01-07","11/12","10/11","09/10",null,"2012-01-07","11/12","10/11","09/10"]
[null,null,null,null,null,null,null,"2012-01-08","11/12","10/11","09/10",null,"2012-01-08","11/12","10/11","09/10"]
[null,null,null,null,null,null,null,"2012-01-09","11/12","10/11","09/10",null,"2012-01-09","11/12","10/11","09/10"]
[null,null,null,null,null,null,null,"2012-01-10","11/12","10/11","09/10",null,"2012-01-10","11/12","10/11","09/10"]
[null,null,null,null,null,null,null,"2012-01-11","11/12","10/11","09/10",null,"2012-01-11","11/12","10/11","09/10"]
[null,null,null,null,null,null,null,"2012-01-12","11/12","10/11","09/10",null,"2012-01-12","11/12","10/11","09/10"]
[null,null,null,null,null,null,null,"2012-01-13","11/12","10/11","09/10",null,"2012-01-13","11/12","10/11","09/10"]
[null,null,null,null,null,null,null,"2012-01-14","11/12","10/11","09/10",null,"2012-01-14","11/12","10/11","09/10"]
[null,null,null,null,null,null,null,"2012-01-15","11/12","10/11","09/10",null,"2012-01-15","11/12","10/11","09/10"]
[null,null,null,null,null,null,null,"2012-01-16","11/12","10/11","09/10",null,"2012-01-16","11/12","10/11","09/10"]
[null,null,null,null,null,null,null,"2012-01-17","11/12","10/11","09/10",null,"2012-01-17","11/12","10/11","09/10"]
[null,null,null,null,null,null,null,"2012-01-18","11/12","10/11","09/10",null,"2012-01-18","11/12","10/11","09/10"]
[null,null,null,null,null,null,null,"2012-01-19","11/12","10/11","09/10",null,"2012-01-19","11/12","10/11","09/10"]
[null,null,null,null,null,null,null,"2012-01-20","11/12","10/11","09/10",null,"2012-01-20","11/12","10/11","09/10"]
[null,null,null,null,null,null,null,"2012-01-21","11/12","10/11","09/10",null,"2012-01-21","11/12","10/11","09/10"]
[null,null,null,null,null,null,null,"2012-01-22","11/12","10/11","09/10",null,"2012-01-22","11/12","10/11","09/10"]
[null,null,null,null,null,null,null,"2012-01-23","11/12","10/11","09/10",null,"2012-01-23","11/12","10/11","09/10"]
[null,null,null,null,null,null,null,"2012-01-24","11/12","10/11","09/10",null,"2012-01-24","11/12","10/11","09/10"]
[null,null,null,null,null,null,null,"2012-01-25","11/12","10/11","09/10",null,"2012-01-25","11/12","10/11","09/10"]
[null,null,null,null,null,null,null,"2012-01-26","11/12","10/11","09/10",null,"2012-01-26","11/12","10/11","09/10"]
[null,null,null,null,null,null,null,"2012-01-27","11/12","10/11","09/10",null,"2012-01-27","11/12","10/11","09/10"]
[null,null,null,null,null,null,null,"2012-01-28","11/12","10/11","09/10",null,"2012-01-28","11/12","10/11","09/10"]
[null,null,null,null,null,null,null,"2012-01-29","11/12","10/11","09/10",null,"2012-01-29","11/12","10/11","09/10"]
[null,null,null,null,null,null,null,"2012-01-30","11/12","10/11","09/10",null,"2012-01-30","11/12","10/11","09/10"]
[null,null,null,null,null,null,null,"2012-01-31","11/12","10/11","09/10",null,"2012-01-31","11/12","10/11","09/10"]
[null,null,null,null,null,null,null,"2012-02-01","11/12","10/11","09/10",null,"2012-02-01","11/12","10/11","09/10"]
[null,null,null,null,null,null,null,"2012-02-02","11/12","10/11","09/10",null,"2012-02-02","11/12","10/11","09/10"]
[null,null,null,null,null,null,null,"2012-02-03","11/12","10/11","09/10",null,"2012-02-03","11/12","10/11","09/10"]
[null,null,null,null,null,null,null,"2012-02-04","11/12","10/11","09/10",null,"2012-02-04","11/12","10/11","09/10"]
[null,null,null,null,null,null,null,"2012-02-05","11/12","10/11","09/10",null,"2012-02-05","11/12","10/11","09/10"]
[null,null,null,null,null,null,null,"2012-02-06","11/12","10/11","09/10",null,"2012-02-06","11/12","10/11","09/10"]
[null,null,null,null,null,null,null,"2012-02-07","11/12","10/11","09/10",null,"2012-02-07","11/12","10/11","09/10"]
[null,null,null,null,null,null,null,"2012-02-08","11/12","10/11","09/10",null,"2012-02-08","11/12","10/11","09/10"]
[null,null,null,null,null,null,null,"2012-02-09","11/12","10/11","09/10",null,"2012-02-09","11/12","10/11","09/10"]
[null,null,null,null,null,null,null,"2012-02-10","11/12","10/11","09/10",null,"2012-02-10","11/12","10/11","09/10"]
[null,null,null,null,null,null,null,"2012-02-11","11/12","10/11","09/10",null,"2012-02-11","11/12","10/11","09/10"]
[null,null,null,null,null,null,null,"2012-02-12","11/12","10/11","09/10",null,"2012-02-12","11/12","10/11","09/10"]
[null,null,null,null,null,null,null,"2012-02-13","11/12","10/11","09/10",null,"2012-02-13","11/12","10/11","09/10"]
[null,null,null,null,null,null,null,"2012-02-14","11/12","10/11","09/10",null,"2012-02-14","11/12","10/11","09/10"]
[null,null,null,null,null,null,null,"2012-02-15","11/12","10/11","09/10",null,"2012-02-15","11/12","10/11","09/10"]
[null,null,null,null,null,null,null,"2012-02-16","11/12","10/11","09/10",null,"2012-02-16","11/12","10/11","09/10"]
[null,null,null,null,null,null,null,"2012-02-17","11/12","10/11","09/10",null,"2012-02-17","11/12","10/11","09/10"]
[null,null,null,null,null,null,null,"2012-02-18","11/12","10/11","09/10",null,"2012-02-18","11/12","10/11","09/10"]
[null,null,null,null,null,null,null,"2012-02-19","11/12","10/11","09/10",null,"2012-02-19","11/12","10/11","09/10"]
[null,null,null,null,null,null,null,"2012-02-20","11/12","10/11","09/10",null,"2012-02-20","11/12","10/11","09/10"]
[null,null,null,null,null,null,null,"2012-02-21","11/12","10/11","09/10",null,"2012-02-21","11/12","10/11","09/10"]
[null,null,null,null,null,null,null,"2012-02-22","11/12","10/11","09/10",null,"2012-02-22","11/12","10/11","09/10"]
[null,null,null,null,null,null,null,"2012-02-23","11/12","10/11","09/10",null,"2012-02-23","11/12","10/11","09/10"]
[null,null,null,null,null,null,null,"2012-02-24","11/12","10/11","09/10",null,"2012-02-24","11/12","10/11","09/10"]
[null,null,null,null,null,null,null,"2012-02-25","11/12","10/11","09/10",null,"2012-02-25","11/12","10/11","09/10"]
[null,null,null,null,null,null,null,"2012-02-26","11/12","10/11","09/10",null,"2012-02-26","11/12","10/11","09/10"]
[null,null,null,null,null,null,null,"2012-02-27","11/12","10/11","09/10",null,"2012-02-27","11/12","10/11","09/10"]
[null,null,null,null,null,null,null,"2012-02-28","11/12","10/11","09/10",null,"2012-02-28","11/12","10/11","09/10"]
[null,null,null,null,null,null,null,"2012-02-29","11/12","10/11","09/10",null,"2012-02-29","11/12","10/11","09/10"]
[null,null,null,null,null,null,null,"2012-03-01","11/12","10/11","09/10",null,"2012-03-01","11/12","10/11","09/10"]
[null,null,null,null,null,null,null,"2012-03-02","11/12","10/11","09/10",null,"2012-03-02","11/12","10/11","09/10"]
[null,null,null,null,null,null,null,"2012-03-03","11/12","10/11","09/10",null,"2012-03-03","11/12","10/11","09/10"]
[null,null,null,null,null,null,null,"2012-03-04","11/12","10/11","09/10",null,"2012-03-04","11/12","10/11","09/10"]
[null,null,null,null,null,null,null,"2012-03-05","11/12","10/11","09/10",null,"2012-03-05","11/12","10/11","09/10"]
[null,null,null,null,null,null,null,"2012-03-06","11/12","10/11","09/10",null,"2012-03-06","11/12","10/11","09/10"]
[null,null,null,null,null,null,null,"2012-03-07","11/12","10/11","09/10",null,"2012-03-07","11/12","10/11","09/10"]
[null,null,null,null,null,null,null,"2012-03-08","11/12","10/11","09/10",null,"2012-03-08","11/12","10/11","09/10"]
[null,null,null,null,null,null,null,"2012-03-09","11/12","10/11","09/10",null,"2012-03-09","11/12","10/11","09/10"]
[null,null,null,null,null,null,null,"2012-03-10","11/12","10/11","09/10",null,"2012-03-10","11/12","10/11","09/10"]
[null,null,null,null,null,null,null,"2012-03-11","11/12","10/11","09/10",null,"2012-03-11","11/12","10/11","09/10"]
[null,null,null,null,null,null,null,"2012-03-12","11/12","10/11","09/10",null,"2012-03-12","11/12","10/11","09/10"]
[null,null,null,null,null,null,null,"2012-03-13","11/12","10/11","09/10",null,"2012-03-13","11/12","10/11","09/10"]
[null,null,null,null,null,null,null,"2012-03-14","11/12","10/11","09/10",null,"2012-03-14","11/12","10/11","09/10"]
[null,null,null,null,null,null,null,"2012-03-15","11/12","10/11","09/10",null,"2012-03-15","11/12","10/11","09/10"]
[null,null,null,null,null,null,null,"2012-03-16","11/12","10/11","09/10",null,"2012-03-16","11/12","10/11","09/10"]
[null,null,null,null,null,null,null,"2012-03-17","11/12","10/11","09/10",null,"2012-03-17","11/12","10/11","09/10"]
[null,null,null,null,null,null,null,"2012-03-18","11/12","10/11","09/10",null,"2012-03-18","11/12","10/11","09/10"]
[null,null,null,null,null,null,null,"2012-03-19","11/12","10/11","09/10",null,"2012-03-19","11/12","10/11","09/10"]
[null,null,null,null,null,null,null,"2012-03-20","11/12","10/11","09/10",null,"2012-03-20","11/12","10/11","09/10"]
[null,null,null,null,null,null,null,"2012-03-21","11/12","10/11","09/10",null,"2012-03-21","11/12","10/11","09/10"]
[null,null,null,null,null,null,null,"2012-03-22","11/12","10/11","09/10",null,"2012-03-22","11/12","10/11","09/10"]
[null,null,null,null,null,null,null,"2012-03-23","11/12","10/11","09/10",null,"2012-03-23","11/12","10/11","09/10"]
[null,null,null,null,null,null,null,"2012-03-24","11/12","10/11","09/10",null,"2012-03-24","11/12","10/11","09/10"]
[null,null,null,null,null,null,null,"2012-03-25","11/12","10/11","09/10",null,"2012-03-25","11/12","10/11","09/10"]
[null,null,null,null,null,null,null,"2012-03-26","11/12","10/11","09/10",null,"2012-03-26","11/12","10/11","09/10"]
[null,null,null,null,null,null,null,"2012-03-27","11/12","10/11","09/10",null,"2012-03-27","11/12","10/11","09/10"]
[null,null,null,null,null,null,null,"2012-03-28","11/12","10/11","09/10",null,"2012-03-28","11/12","10/11","09/10"]
[null,null,null,null,null,null,null,"2012-03-29","11/12","10/11","09/10",null,"2012-03-29","11/12","10/11","09/10"]
[null,null,null,null,null,null,null,"2012-03-30","11/12","10/11","09/10",null,"2012-03-30","11/12","10/11","09/10"]
[null,null,null,null,null,null,null,"2012-03-31","11/12","10/11","09/10",null,"2012-03-31","11/12","10/11","09/10"]
[null,null,null,null,null,null,null,"2012-04-01","11/12","10/11","09/10",null,"2012-04-01","11/12","10/11","09/10"]
[null,null,null,null,null,null,null,"2012-04-02","11/12","10/11","09/10",null,"2012-04-02","11/12","10/11","09/10"]
[null,null,null,null,null,null,null,"2012-04-03","11/12","10/11","09/10",null,"2012-04-03","11/12","10/11","09/10"]
[null,null,null,null,null,null,null,"2012-04-04","11/12","10/11","09/10",null,"2012-04-04","11/12","10/11","09/10"]
[null,null,null,null,null,null,null,"2012-04-05","11/12","11/12","10/11",null,"2012-04-05","11/12","11/12","10/11"]
[null,null,null,null,null,null,null,"2012-04-06","12/13","11/12","10/11",null,"2012-04-06","12/13","11/12","10/11"]
[null,null,null,null,null,null,null,"2012-04-07","12/13","11/12","10/11",null,"2012-04-07","12/13","11/12","10/11"]
[null,null,null,null,null,null,null,"2012-04-08","12/13","11/12","10/11",null,"2012-04-08","12/13","11/12","10/11"]
[null,null,null,null,null,null,null,"2012-04-09","12/13","11/12","10/11",null,"2012-04-09","12/13","11/12","10/11"]
[null,null,null,null,null,null,null,"2012-04-10","12/13","11/12","10/11",null,"2012-04-10","12/13","11/12","10/11"]
[null,null,null,null,null,null,null,"2012-04-11","12/13","11/12","10/11",null,"2012-04-11","12/13","11/12","10/11"]
[null,null,null,null,null,null,null,"2012-04-12","12/13","11/12","10/11",null,"2012-04-12","12/13","11/12","10/11"]
[null,null,null,null,null,null,null,"2012-04-13","12/13","11/12","10/11",null,"2012-04-13","12/13","11/12","10/11"]
[null,null,null,null,null,null,null,"2012-04-14","12/13","11/12","10/11",null,"2012-04-14","12/13","11/12","10/11"]
[null,null,null,null,null,null,null,"2012-04-15","12/13","11/12","10/11",null,"2012-04-15","12/13","11/12","10/11"]
[null,null,null,null,null,null,null,"2012-04-16","12/13","11/12","10/11",null,"2012-04-16","12/13","11/12","10/11"]
[null,null,null,null,null,null,null,"2012-04-17","12/13","11/12","10/11",null,"2012-04-17","12/13","11/12","10/11"]
[null,null,null,null,null,null,null,"2012-04-18","12/13","11/12","10/11",null,"2012-04-18","12/13","11/12","10/11"]
[null,null,null,null,null,null,null,"2012-04-19","12/13","11/12","10/11",null,"2012-04-19","12/13","11/12","10/11"]
[null,null,null,null,null,null,null,"2012-04-20","12/13","11/12","10/11",null,"2012-04-20","12/13","11/12","10/11"]
[null,null,null,null,null,null,null,"2012-04-21","12/13","11/12","10/11",null,"2012-04-21","12/13","11/12","10/11"]
[null,null,null,null,null,null,null,"2012-04-22","12/13","11/12","10/11",null,"2012-04-22","12/13","11/12","10/11"]
[null,null,null,null,null,null,null,"2012-04-23","12/13","11/12","10/11",null,"2012-04-23","12/13","11/12","10/11"]
[null,null,null,null,null,null,null,"2012-04-24","12/13","11/12","10/11",null,"2012-04-24","12/13","11/12","10/11"]
[null,null,null,null,null,null,null,"2012-04-25","12/13","11/12","10/11",null,"2012-04-25","12/13","11/12","10/11"]
[null,null,null,null,null,null,null,"2012-04-26","12/13","11/12","10/11",null,"2012-04-26","12/13","11/12","10/11"]
[null,null,null,null,null,null,null,"2012-04-27","12/13","11/12","10/11",null,"2012-04-27","12/13","11/12","10/11"]
[null,null,null,null,null,null,null,"2012-04-28","12/13","11/12","10/11",null,"2012-04-28","12/13","11/12","10/11"]
[null,null,null,null,null,null,null,"2012-04-29","12/13","11/12","10/11",null,"2012-04-29","12/13","11/12","10/11"]
[null,null,null,null,null,null,null,"2012-04-30","12/13","11/12","10/11",null,"2012-04-30","12/13","11/12","10/11"]
[null,null,null,null,null,null,null,"2012-05-01","12/13","11/12","10/11",null,"2012-05-01","12/13","11/12","10/11"]
[null,null,null,null,null,null,null,"2012-05-02","12/13","11/12","10/11",null,"2012-05-02","12/13","11/12","10/11"]
[null,null,null,null,null,null,null,"2012-05-03","12/13","11/12","10/11",null,"2012-05-03","12/13","11/12","10/11"]
[null,null,null,null,null,null,null,"2012-05-04","12/13","11/12","10/11",null,"2012-05-04","12/13","11/12","10/11"]
[null,null,null,null,null,null,null,"2012-05-05","12/13","11/12","10/11",null,"2012-05-05","12/13","11/12","10/11"]
[null,null,null,null,null,null,null,"2012-05-06","12/13","11/12","10/11",null,"2012-05-06","12/13","11/12","10/11"]
[null,null,null,null,null,null,null,"2012-05-07","12/13","11/12","10/11",null,"2012-05-07","12/13","11/12","10/11"]
[null,null,null,null,null,null,null,"2012-05-08","12/13","11/12","10/11",null,"2012-05-08","12/13","11/12","10/11"]
[null,null,null,null,null,null,null,"2012-05-09","12/13","11/12","10/11",null,"2012-05-09","12/13","11/12","10/11"]
[null,null,null,null,null,null,null,"2012-05-10","12/13","11/12","10/11",null,"2012-05-10","12/13","11/12","10/11"]
[null,null,null,null,null,null,null,"2012-05-11","12/13","11/12","10/11",null,"2012-05-11","12/13","11/12","10/11"]
[null,null,null,null,null,null,null,"2012-05-12","12/13","11/12","10/11",null,"2012-05-12","12/13","11/12","10/11"]
[null,null,null,null,null,null,null,"2012-05-13","12/13","11/12","10/11",null,"2012-05-13","12/13","11/12","10/11"]
[null,null,null,null,null,null,null,"2012-05-14","12/13","11/12","10/11",null,"2012-05-14","12/13","11/12","10/11"]
[null,null,null,null,null,null,null,"2012-05-15","12/13","11/12","10/11",null,"2012-05-15","12/13","11/12","10/11"]
[null,null,null,null,null,null,null,"2012-05-16","12/13","11/12","10/11",null,"2012-05-16","12/13","11/12","10/11"]
[null,null,null,null,null,null,null,"2012-05-17","12/13","11/12","10/11",null,"2012-05-17","12/13","11/12","10/11"]
[null,null,null,null,null,null,null,"2012-05-18","12/13","11/12","10/11",null,"2012-05-18","12/13","11/12","10/11"]
[null,null,null,null,null,null,null,"2012-05-19","12/13","11/12","10/11",null,"2012-05-19","12/13","11/12","10/11"]
[null,null,null,null,null,null,null,"2012-05-20","12/13","11/12","10/11",null,"2012-05-20","12/13","11/12","10/11"]
[null,null,null,null,null,null,null,"2012-05-21","12/13","11/12","10/11",null,"2012-05-21","12/13","11/12","10/11"]
[null,null,null,null,null,null,null,"2012-05-22","12/13","11/12","10/11",null,"2012-05-22","12/13","11/12","10/11"]
[null,null,null,null,null,null,null,"2012-05-23","12/13","11/12","10/11",null,"2012-05-23","12/13","11/12","10/11"]
[null,null,null,null,null,null,null,"2012-05-24","12/13","11/12","10/11",null,"2012-05-24","12/13","11/12","10/11"]
[null,null,null,null,null,null,null,"2012-05-25","12/13","11/12","10/11",null,"2012-05-25","12/13","11/12","10/11"]
[null,null,null,null,null,null,null,"2012-05-26","12/13","11/12","10/11",null,"2012-05-26","12/13","11/12","10/11"]
[null,null,null,null,null,null,null,"2012-05-27","12/13","11/12","10/11",null,"2012-05-27","12/13","11/12","10/11"]
[null,null,null,null,null,null,null,"2012-05-28","12/13","11/12","10/11",null,"2012-05-28","12/13","11/12","10/11"]
[null,null,null,null,null,null,null,"2012-05-29","12/13","11/12","10/11",null,"2012-05-29","12/13","11/12","10/11"]
[null,null,null,null,null,null,null,"2012-05-30","12/13","11/12","10/11",null,"2012-05-30","12/13","11/12","10/11"]
[null,null,null,null,null,null,null,"2012-05-31","12/13","11/12","10/11",null,"2012-05-31","12/13","11/12","10/11"]
[null,null,null,null,null,null,null,"2012-06-01","12/13","11/12","10/11",null,"2012-06-01","12/13","11/12","10/11"]
[null,null,null,null,null,null,null,"2012-06-02","12/13","11/12","10/11",null,"2012-06-02","12/13","11/12","10/11"]
[null,null,null,null,null,null,null,"2012-06-03","12/13","11/12","10/11",null,"2012-06-03","12/13","11/12","10/11"]
[null,null,null,null,null,null,null,"2012-06-04","12/13","11/12","10/11",null,"2012-06-04","12/13","11/12","10/11"]
[null,null,null,null,null,null,null,"2012-06-05","12/13","11/12","10/11",null,"2012-06-05","12/13","11/12","10/11"]
[null,null,null,null,null,null,null,"2012-06-06","12/13","11/12","10/11",null,"2012-06-06","12/13","11/12","10/11"]
[null,null,null,null,null,null,null,"2012-06-07","12/13","11/12","10/11",null,"2012-06-07","12/13","11/12","10/11"]
[null,null,null,null,null,null,null,"2012-06-08","12/13","11/12","10/11",null,"2012-06-08","12/13","11/12","10/11"]
[null,null,null,null,null,null,null,"2012-06-09","12/13","11/12","10/11",null,"2012-06-09","12/13","11/12","10/11"]
[null,null,null,null,null,null,null,"2012-06-10","12/13","11/12","10/11",null,"2012-06-10","12/13","11/12","10/11"]
[null,null,null,null,null,null,null,"2012-06-11","12/13","11/12","10/11",null,"2012-06-11","12/13","11/12","10/11"]
[null,null,null,null,null,null,null,"2012-06-12","12/13","11/12","10/11",null,"2012-06-12","12/13","11/12","10/11"]
[null,null,null,null,null,null,null,"2012-06-13","12/13","11/12","10/11",null,"2012-06-13","12/13","11/12","10/11"]
[null,null,null,null,null,null,null,"2012-06-14","12/13","11/12","10/11",null,"2012-06-14","12/13","11/12","10/11"]
[null,null,null,null,null,null,null,"2012-06-15","12/13","11/12","10/11",null,"2012-06-15","12/13","11/12","10/11"]
[null,null,null,null,null,null,null,"2012-06-16","12/13","11/12","10/11",null,"2012-06-16","12/13","11/12","10/11"]
[null,null,null,null,null,null,null,"2012-06-17","12/13","11/12","10/11",null,"2012-06-17","12/13","11/12","10/11"]
[null,null,null,null,null,null,null,"2012-06-18","12/13","11/12","10/11",null,"2012-06-18","12/13","11/12","10/11"]
[null,null,null,null,null,null,null,"2012-06-19","12/13","11/12","10/11",null,"2012-06-19","12/13","11/12","10/11"]
[null,null,null,null,null,null,null,"2012-06-20","12/13","11/12","10/11",null,"2012-06-20","12/13","11/12","10/11"]
[null,null,null,null,null,null,null,"2012-06-21","12/13","11/12","10/11",null,"2012-06-21","12/13","11/12","10/11"]
[null,null,null,null,null,null,null,"2012-06-22","12/13","11/12","10/11",null,"2012-06-22","12/13","11/12","10/11"]
[null,null,null,null,null,null,null,"2012-06-23","12/13","11/12","10/11",null,"2012-06-23","12/13","11/12","10/11"]
[null,null,null,null,null,null,null,"2012-06-24","12/13","11/12","10/11",null,"2012-06-24","12/13","11/12","10/11"]
[null,null,null,null,null,null,null,"2012-06-25","12/13","11/12","10/11",null,"2012-06-25","12/13","11/12","10/11"]
[null,null,null,null,null,null,null,"2012-06-26","12/13","11/12","10/11",null,"2012-06-26","12/13","11/12","10/11"]
[null,null,null,null,null,null,null,"2012-06-27","12/13","11/12","10/11",null,"2012-06-27","12/13","11/12","10/11"]
[null,null,null,null,null,null,null,"2012-06-28","12/13","11/12","10/11",null,"2012-06-28","12/13","11/12","10/11"]
[null,null,null,null,null,null,null,"2012-06-29","12/13","11/12","10/11",null,"2012-06-29","12/13","11/12","10/11"]
[null,null,null,null,null,null,null,"2012-06-30","12/13","11/12","10/11",null,"2012-06-30","12/13","11/12","10/11"]
[null,null,null,null,null,null,null,"2012-07-01","12/13","11/12","10/11",null,"2012-07-01","12/13","11/12","10/11"]
[null,null,null,null,null,null,null,"2012-07-02","12/13","11/12","10/11",null,"2012-07-02","12/13","11/12","10/11"]
[null,null,null,null,null,null,null,"2012-07-03","12/13","11/12","10/11",null,"2012-07-03","12/13","11/12","10/11"]
[null,null,null,null,null,null,null,"2012-07-04","12/13","11/12","10/11",null,"2012-07-04","12/13","11/12","10/11"]
[null,null,null,null,null,null,null,"2012-07-05","12/13","11/12","10/11",null,"2012-07-05","12/13","11/12","10/11"]
[null,null,null,null,null,null,null,"2012-07-06","12/13","11/12","10/11",null,"2012-07-06","12/13","11/12","10/11"]
[null,null,null,null,null,null,null,"2012-07-07","12/13","11/12","10/11",null,"2012-07-07","12/13","11/12","10/11"]
[null,null,null,null,null,null,null,"2012-07-08","12/13","11/12","10/11",null,"2012-07-08","12/13","11/12","10/11"]
[null,null,null,null,null,null,null,"2012-07-09","12/13","11/12","10/11",null,"2012-07-09","12/13","11/12","10/11"]
[null,null,null,null,null,null,null,"2012-07-10","12/13","11/12","10/11",null,"2012-07-10","12/13","11/12","10/11"]
[null,null,null,null,null,null,null,"2012-07-11","12/13","11/12","10/11",null,"2012-07-11","12/13","11/12","10/11"]
[null,null,null,null,null,null,null,"2012-07-12","12/13","11/12","10/11",null,"2012-07-12","12/13","11/12","10/11"]
[null,null,null,null,null,null,null,"2012-07-13","12/13","11/12","10/11",null,"2012-07-13","12/13","11/12","10/11"]
[null,null,null,null,null,null,null,"2012-07-14","12/13","11/12","10/11",null,"2012-07-14","12/13","11/12","10/11"]
[null,null,null,null,null,null,null,"2012-07-15","12/13","11/12","10/11",null,"2012-07-15","12/13","11/12","10/11"]
[null,null,null,null,null,null,null,"2012-07-16","12/13","11/12","10/11",null,"2012-07-16","12/13","11/12","10/11"]
[null,null,null,null,null,null,null,"2012-07-17","12/13","11/12","10/11",null,"2012-07-17","12/13","11/12","10/11"]
[null,null,null,null,null,null,null,"2012-07-18","12/13","11/12","10/11",null,"2012-07-18","12/13","11/12","10/11"]
[null,null,null,null,null,null,null,"2012-07-19","12/13","11/12","10/11",null,"2012-07-19","12/13","11/12","10/11"]
[null,null,null,null,null,null,null,"2012-07-20","12/13","11/12","10/11",null,"2012-07-20","12/13","11/12","10/11"]
[null,null,null,null,null,null,null,"2012-07-21","12/13","11/12","10/11",null,"2012-07-21","12/13","11/12","10/11"]
[null,null,null,null,null,null,null,"2012-07-22","12/13","11/12","10/11",null,"2012-07-22","12/13","11/12","10/11"]
[null,null,null,null,null,null,null,"2012-07-23","12/13","11/12","10/11",null,"2012-07-23","12/13","11/12","10/11"]
[null,null,null,null,null,null,null,"2012-07-24","12/13","11/12","10/11",null,"2012-07-24","12/13","11/12","10/11"]
[null,null,null,null,null,null,null,"2012-07-25","12/13","11/12","10/11",null,"2012-07-25","12/13","11/12","10/11"]
[null,null,null,null,null,null,null,"2012-07-26","12/13","11/12","10/11",null,"2012-07-26","12/13","11/12","10/11"]
[null,null,null,null,null,null,null,"2012-07-27","12/13","11/12","10/11",null,"2012-07-27","12/13","11/12","10/11"]
[null,null,null,null,null,null,null,"2012-07-28","12/13","11/12","10/11",null,"2012-07-28","12/13","11/12","10/11"]
[null,null,null,null,null,null,null,"2012-07-29","12/13","11/12","10/11",null,"2012-07-29","12/13","11/12","10/11"]
[null,null,null,null,null,null,null,"2012-07-30","12/13","11/12","10/11",null,"2012-07-30","12/13","11/12","10/11"]
[null,null,null,null,null,null,null,"2012-07-31","12/13","11/12","10/11",null,"2012-07-31","12/13","11/12","10/11"]
[null,null,null,null,null,null,null,"2012-08-01","12/13","11/12","10/11",null,"2012-08-01","12/13","11/12","10/11"]
[null,null,null,null,null,null,null,"2012-08-02","12/13","11/12","10/11",null,"2012-08-02","12/13","11/12","10/11"]
[null,null,null,null,null,null,null,"2012-08-03","12/13","11/12","10/11",null,"2012-08-03","12/13","11/12","10/11"]
[null,null,null,null,null,null,null,"2012-08-04","12/13","11/12","10/11",null,"2012-08-04","12/13","11/12","10/11"]
[null,null,null,null,null,null,null,"2012-08-05","12/13","11/12","10/11",null,"2012-08-05","12/13","11/12","10/11"]
[null,null,null,null,null,null,null,"2012-08-06","12/13","11/12","10/11",null,"2012-08-06","12/13","11/12","10/11"]
[null,null,null,null,null,null,null,"2012-08-07","12/13","11/12","10/11",null,"2012-08-07","12/13","11/12","10/11"]
[null,null,null,null,null,null,null,"2012-08-08","12/13","11/12","10/11",null,"2012-08-08","12/13","11/12","10/11"]
[null,null,null,null,null,null,null,"2012-08-09","12/13","11/12","10/11",null,"2012-08-09","12/13","11/12","10/11"]
[null,null,null,null,null,null,null,"2012-08-10","12/13","11/12","10/11",null,"2012-08-10","12/13","11/12","10/11"]
[null,null,null,null,null,null,null,"2012-08-11","12/13","11/12","10/11",null,"2012-08-11","12/13","11/12","10/11"]
[null,null,null,null,null,null,null,"2012-08-12","12/13","11/12","10/11",null,"2012-08-12","12/13","11/12","10/11"]
[null,null,null,null,null,null,null,"2012-08-13","12/13","11/12","10/11",null,"2012-08-13","12/13","11/12","10/11"]
[null,null,null,null,null,null,null,"2012-08-14","12/13","11/12","10/11",null,"2012-08-14","12/13","11/12","10/11"]
[null,null,null,null,null,null,null,"2012-08-15","12/13","11/12","10/11",null,"2012-08-15","12/13","11/12","10/11"]
[null,null,null,null,null,null,null,"2012-08-16","12/13","11/12","10/11",null,"2012-08-16","12/13","11/12","10/11"]
[null,null,null,null,null,null,null,"2012-08-17","12/13","11/12","10/11",null,"2012-08-17","12/13","11/12","10/11"]
[null,null,null,null,null,null,null,"2012-08-18","12/13","11/12","10/11",null,"2012-08-18","12/13","11/12","10/11"]
[null,null,null,null,null,null,null,"2012-08-19","12/13","11/12","10/11",null,"2012-08-19","12/13","11/12","10/11"]
[null,null,null,null,null,null,null,"2012-08-20","12/13","11/12","10/11",null,"2012-08-20","12/13","11/12","10/11"]
[null,null,null,null,null,null,null,"2012-08-21","12/13","11/12","10/11",null,"2012-08-21","12/13","11/12","10/11"]
[null,null,null,null,null,null,null,"2012-08-22","12/13","11/12","10/11",null,"2012-08-22","12/13","11/12","10/11"]
[null,null,null,null,null,null,null,"2012-08-23","12/13","11/12","10/11",null,"2012-08-23","12/13","11/12","10/11"]
[null,null,null,null,null,null,null,"2012-08-24","12/13","11/12","10/11",null,"2012-08-24","12/13","11/12","10/11"]
[null,null,null,null,null,null,null,"2012-08-25","12/13","11/12","10/11",null,"2012-08-25","12/13","11/12","10/11"]
[null,null,null,null,null,null,null,"2012-08-26","12/13","11/12","10/11",null,"2012-08-26","12/13","11/12","10/11"]
[null,null,null,null,null,null,null,"2012-08-27","12/13","11/12","10/11",null,"2012-08-27","12/13","11/12","10/11"]
[null,null,null,null,null,null,null,"2012-08-28","12/13","11/12","10/11",null,"2012-08-28","12/13","11/12","10/11"]
[null,null,null,null,null,null,null,"2012-08-29","12/13","11/12","10/11",null,"2012-08-29","12/13","11/12","10/11"]
[null,null,null,null,null,null,null,"2012-08-30","12/13","11/12","10/11",null,"2012-08-30","12/13","11/12","10/11"]
[null,null,null,null,null,null,null,"2012-08-31","12/13","11/12","10/11",null,"2012-08-31","12/13","11/12","10/11"]
[null,null,null,null,null,null,null,"2012-09-01","12/13","11/12","10/11",null,"2012-09-01","12/13","11/12","10/11"]
[null,null,null,null,null,null,null,"2012-09-02","12/13","11/12","10/11",null,"2012-09-02","12/13","11/12","10/11"]
[null,null,null,null,null,null,null,"2012-09-03","12/13","11/12","10/11",null,"2012-09-03","12/13","11/12","10/11"]
[null,null,null,null,null,null,null,"2012-09-04","12/13","11/12","10/11",null,"2012-09-04","12/13","11/12","10/11"]
[null,null,null,null,null,null,null,"2012-09-05","12/13","11/12","10/11",null,"2012-09-05","12/13","11/12","10/11"]
[null,null,null,null,null,null,null,"2012-09-06","12/13","11/12","10/11",null,"2012-09-06","12/13","11/12","10/11"]
[null,null,null,null,null,null,null,"2012-09-07","12/13","11/12","10/11",null,"2012-09-07","12/13","11/12","10/11"]
[null,null,null,null,null,null,null,"2012-09-08","12/13","11/12","10/11",null,"2012-09-08","12/13","11/12","10/11"]
[null,null,null,null,null,null,null,"2012-09-09","12/13","11/12","10/11",null,"2012-09-09","12/13","11/12","10/11"]
[null,null,null,null,null,null,null,"2012-09-10","12/13","11/12","10/11",null,"2012-09-10","12/13","11/12","10/11"]
[null,null,null,null,null,null,null,"2012-09-11","12/13","11/12","10/11",null,"2012-09-11","12/13","11/12","10/11"]
[null,null,null,null,null,null,null,"2012-09-12","12/13","11/12","10/11",null,"2012-09-12","12/13","11/12","10/11"]
[null,null,null,null,null,null,null,"2012-09-13","12/13","11/12","10/11",null,"2012-09-13","12/13","11/12","10/11"]
[null,null,null,null,null,null,null,"2012-09-14","12/13","11/12","10/11",null,"2012-09-14","12/13","11/12","10/11"]
[null,null,null,null,null,null,null,"2012-09-15","12/13","11/12","10/11",null,"2012-09-15","12/13","11/12","10/11"]
[null,null,null,null,null,null,null,"2012-09-16","12/13","11/12","10/11",null,"2012-09-16","12/13","11/12","10/11"]
[null,null,null,null,null,null,null,"2012-09-17","12/13","11/12","10/11",null,"2012-09-17","12/13","11/12","10/11"]
[null,null,null,null,null,null,null,"2012-09-18","12/13","11/12","10/11",null,"2012-09-18","12/13","11/12","10/11"]
[null,null,null,null,null,null,null,"2012-09-19","12/13","11/12","10/11",null,"2012-09-19","12/13","11/12","10/11"]
[null,null,null,null,null,null,null,"2012-09-20","12/13","11/12","10/11",null,"2012-09-20","12/13","11/12","10/11"]
[null,null,null,null,null,null,null,"2012-09-21","12/13","11/12","10/11",null,"2012-09-21","12/13","11/12","10/11"]
[null,null,null,null,null,null,null,"2012-09-22","12/13","11/12","10/11",null,"2012-09-22","12/13","11/12","10/11"]
[null,null,null,null,null,null,null,"2012-09-23","12/13","11/12","10/11",null,"2012-09-23","12/13","11/12","10/11"]
[null,null,null,null,null,null,null,"2012-09-24","12/13","11/12","10/11",null,"2012-09-24","12/13","11/12","10/11"]
[null,null,null,null,null,null,null,"2012-09-25","12/13","11/12","10/11",null,"2012-09-25","12/13","11/12","10/11"]
[null,null,null,null,null,null,null,"2012-09-26","12/13","11/12","10/11",null,"2012-09-26","12/13","11/12","10/11"]
[null,null,null,null,null,null,null,"2012-09-27","12/13","11/12","10/11",null,"2012-09-27","12/13","11/12","10/11"]
[null,null,null,null,null,null,null,"2012-09-28","12/13","11/12","10/11",null,"2012-09-28","12/13","11/12","10/11"]
[null,null,null,null,null,null,null,"2012-09-29","12/13","11/12","10/11",null,"2012-09-29","12/13","11/12","10/11"]
[null,null,null,null,null,null,null,"2012-09-30","12/13","11/12","10/11",null,"2012-09-30","12/13","11/12","10/11"]
[null,null,null,null,null,null,null,"2012-10-01","12/13","11/12","10/11",null,"2012-10-01","12/13","11/12","10/11"]
[null,null,null,null,null,null,null,"2012-10-02","12/13","11/12","10/11",null,"2012-10-02","12/13","11/12","10/11"]
[null,null,null,null,null,null,null,"2012-10-03","12/13","11/12","10/11",null,"2012-10-03","12/13","11/12","10/11"]
[null,null,null,null,null,null,null,"2012-10-04","12/13","11/12","10/11",null,"2012-10-04","12/13","11/12","10/11"]
[null,null,null,null,null,null,null,"2012-10-05","12/13","11/12","10/11",null,"2012-10-05","12/13","11/12","10/11"]
[null,null,null,null,null,null,null,"2012-10-06","12/13","11/12","10/11",null,"2012-10-06","12/13","11/12","10/11"]
[null,null,null,null,null,null,null,"2012-10-07","12/13","11/12","10/11",null,"2012-10-07","12/13","11/12","10/11"]
[null,null,null,null,null,null,null,"2012-10-08","12/13","11/12","10/11",null,"2012-10-08","12/13","11/12","10/11"]
[null,null,null,null,null,null,null,"2012-10-09","12/13","11/12","10/11",null,"2012-10-09","12/13","11/12","10/11"]
[null,null,null,null,null,null,null,"2012-10-10","12/13","11/12","10/11",null,"2012-10-10","12/13","11/12","10/11"]
[null,null,null,null,null,null,null,"2012-10-11","12/13","11/12","10/11",null,"2012-10-11","12/13","11/12","10/11"]
[null,null,null,null,null,null,null,"2012-10-12","12/13","11/12","10/11",null,"2012-10-12","12/13","11/12","10/11"]
[null,null,null,null,null,null,null,"2012-10-13","12/13","11/12","10/11",null,"2012-10-13","12/13","11/12","10/11"]
[null,null,null,null,null,null,null,"2012-10-14","12/13","11/12","10/11",null,"2012-10-14","12/13","11/12","10/11"]
[null,null,null,null,null,null,null,"2012-10-15","12/13","11/12","10/11",null,"2012-10-15","12/13","11/12","10/11"]
[null,null,null,null,null,null,null,"2012-10-16","12/13","11/12","10/11",null,"2012-10-16","12/13","11/12","10/11"]
[null,null,null,null,null,null,null,"2012-10-17","12/13","11/12","10/11",null,"2012-10-17","12/13","11/12","10/11"]
[null,null,null,null,null,null,null,"2012-10-18","12/13","11/12","10/11",null,"2012-10-18","12/13","11/12","10/11"]
[null,null,null,null,null,null,null,"2012-10-19","12/13","11/12","10/11",null,"2012-10-19","12/13","11/12","10/11"]
[null,null,null,null,null,null,null,"2012-10-20","12/13","11/12","10/11",null,"2012-10-20","12/13","11/12","10/11"]
[null,null,null,null,null,null,null,"2012-10-21","12/13","11/12","10/11",null,"2012-10-21","12/13","11/12","10/11"]
[null,null,null,null,null,null,null,"2012-10-22","12/13","11/12","10/11",null,"2012-10-22","12/13","11/12","10/11"]
[null,null,null,null,null,null,null,"2012-10-23","12/13","11/12","10/11",null,"2012-10-23","12/13","11/12","10/11"]
[null,null,null,null,null,null,null,"2012-10-24","12/13","11/12","10/11",null,"2012-10-24","12/13","11/12","10/11"]
[null,null,null,null,null,null,null,"2012-10-25","12/13","11/12","10/11",null,"2012-10-25","12/13","11/12","10/11"]
[null,null,null,null,null,null,null,"2012-10-26","12/13","11/12","10/11",null,"2012-10-26","12/13","11/12","10/11"]
[null,null,null,null,null,null,null,"2012-10-27","12/13","11/12","10/11",null,"2012-10-27","12/13","11/12","10/11"]
[null,null,null,null,null,null,null,"2012-10-28","12/13","11/12","10/11",null,"2012-10-28","12/13","11/12","10/11"]
[null,null,null,null,null,null,null,"2012-10-29","12/13","11/12","10/11",null,"2012-10-29","12/13","11/12","10/11"]
[null,null,null,null,null,null,null,"2012-10-30","12/13","11/12","10/11",null,"2012-10-30","12/13","11/12","10/11"]
[null,null,null,null,null,null,null,"2012-10-31","12/13","11/12","10/11",null,"2012-10-31","12/13","11/12","10/11"]
[null,null,null,null,null,null,null,"2012-11-01","12/13","11/12","10/11",null,"2012-11-01","12/13","11/12","10/11"]
[null,null,null,null,null,null,null,"2012-11-02","12/13","11/12","10/11",null,"2012-11-02","12/13","11/12","10/11"]
[null,null,null,null,null,null,null,"2012-11-03","12/13","11/12","10/11",null,"2012-11-03","12/13","11/12","10/11"]
[null,null,null,null,null,null,null,"2012-11-04","12/13","11/12","10/11",null,"2012-11-04","12/13","11/12","10/11"]
[null,null,null,null,null,null,null,"2012-11-05","12/13","11/12","10/11",null,"2012-11-05","12/13","11/12","10/11"]
[null,null,null,null,null,null,null,"2012-11-06","12/13","11/12","10/11",null,"2012-11-06","12/13","11/12","10/11"]
[null,null,null,null,null,null,null,"2012-11-07","12/13","11/12","10/11",null,"2012-11-07","12/13","11/12","10/11"]
[null,null,null,null,null,null,null,"2012-11-08","12/13","11/12","10/11",null,"2012-11-08","12/13","11/12","10/11"]
[null,null,null,null,null,null,null,"2012-11-09","12/13","11/12","10/11",null,"2012-11-09","12/13","11/12","10/11"]
[null,null,null,null,null,null,null,"2012-11-10","12/13","11/12","10/11",null,"2012-11-10","12/13","11/12","10/11"]
[null,null,null,null,null,null,null,"2012-11-11","12/13","11/12","10/11",null,"2012-11-11","12/13","11/12","10/11"]
[null,null,null,null,null,null,null,"2012-11-12","12/13","11/12","10/11",null,"2012-11-12","12/13","11/12","10/11"]
[null,null,null,null,null,null,null,"2012-11-13","12/13","11/12","10/11",null,"2012-11-13","12/13","11/12","10/11"]
[null,null,null,null,null,null,null,"2012-11-14","12/13","11/12","10/11",null,"2012-11-14","12/13","11/12","10/11"]
[null,null,null,null,null,null,null,"2012-11-15","12/13","11/12","10/11",null,"2012-11-15","12/13","11/12","10/11"]
[null,null,null,null,null,null,null,"2012-11-16","12/13","11/12","10/11",null,"2012-11-16","12/13","11/12","10/11"]
[null,null,null,null,null,null,null,"2012-11-17","12/13","11/12","10/11",null,"2012-11-17","12/13","11/12","10/11"]
[null,null,null,null,null,null,null,"2012-11-18","12/13","11/12","10/11",null,"2012-11-18","12/13","11/12","10/11"]
[null,null,null,null,null,null,null,"2012-11-19","12/13","11/12","10/11",null,"2012-11-19","12/13","11/12","10/11"]
[null,null,null,null,null,null,null,"2012-11-20","12/13","11/12","10/11",null,"2012-11-20","12/13","11/12","10/11"]
[null,null,null,null,null,null,null,"2012-11-21","12/13","11/12","10/11",null,"2012-11-21","12/13","11/12","10/11"]
[null,null,null,null,null,null,null,"2012-11-22","12/13","11/12","10/11",null,"2012-11-22","12/13","11/12","10/11"]
[null,null,null,null,null,null,null,"2012-11-23","12/13","11/12","10/11",null,"2012-11-23","12/13","11/12","10/11"]
[null,null,null,null,null,null,null,"2012-11-24","12/13","11/12","10/11",null,"2012-11-24","12/13","11/12","10/11"]
[null,null,null,null,null,null,null,"2012-11-25","12/13","11/12","10/11",null,"2012-11-25","12/13","11/12","10/11"]
[null,null,null,null,null,null,null,"2012-11-26","12/13","11/12","10/11",null,"2012-11-26","12/13","11/12","10/11"]
[null,null,null,null,null,null,null,"2012-11-27","12/13","11/12","10/11",null,"2012-11-27","12/13","11/12","10/11"]
[null,null,null,null,null,null,null,"2012-11-28","12/13","11/12","10/11",null,"2012-11-28","12/13","11/12","10/11"]
[null,null,null,null,null,null,null,"2012-11-29","12/13","11/12","10/11",null,"2012-11-29","12/13","11/12","10/11"]
[null,null,null,null,null,null,null,"2012-11-30","12/13","11/12","10/11",null,"2012-11-30","12/13","11/12","10/11"]
[null,null,null,null,null,null,null,"2012-12-01","12/13","11/12","10/11",null,"2012-12-01","12/13","11/12","10/11"]
[null,null,null,null,null,null,null,"2012-12-02","12/13","11/12","10/11",null,"2012-12-02","12/13","11/12","10/11"]
[null,null,null,null,null,null,null,"2012-12-03","12/13","11/12","10/11",null,"2012-12-03","12/13","11/12","10/11"]
[null,null,null,null,null,null,null,"2012-12-04","12/13","11/12","10/11",null,"2012-12-04","12/13","11/12","10/11"]
[null,null,null,null,null,null,null,"2012-12-05","12/13","11/12","10/11",null,"2012-12-05","12/13","11/12","10/11"]
[null,null,null,null,null,null,null,"2012-12-06","12/13","11/12","10/11",null,"2012-12-06","12/13","11/12","10/11"]
[null,null,null,null,null,null,null,"2012-12-07","12/13","11/12","10/11",null,"2012-12-07","12/13","11/12","10/11"]
[null,null,null,null,null,null,null,"2012-12-08","12/13","11/12","10/11",null,"2012-12-08","12/13","11/12","10/11"]
[null,null,null,null,null,null,null,"2012-12-09","12/13","11/12","10/11",null,"2012-12-09","12/13","11/12","10/11"]
[null,null,null,null,null,null,null,"2012-12-10","12/13","11/12","10/11",null,"2012-12-10","12/13","11/12","10/11"]
[null,null,null,null,null,null,null,"2012-12-11","12/13","11/12","10/11",null,"2012-12-11","12/13","11/12","10/11"]
[null,null,null,null,null,null,null,"2012-12-12","12/13","11/12","10/11",null,"2012-12-12","12/13","11/12","10/11"]
[null,null,null,null,null,null,null,"2012-12-13","12/13","11/12","10/11",null,"2012-12-13","12/13","11/12","10/11"]
[null,null,null,null,null,null,null,"2012-12-14","12/13","11/12","10/11",null,"2012-12-14","12/13","11/12","10/11"]
[null,null,null,null,null,null,null,"2012-12-15","12/13","11/12","10/11",null,"2012-12-15","12/13","11/12","10/11"]
[null,null,null,null,null,null,null,"2012-12-16","12/13","11/12","10/11",null,"2012-12-16","12/13","11/12","10/11"]
[null,null,null,null,null,null,null,"2012-12-17","12/13","11/12","10/11",null,"2012-12-17","12/13","11/12","10/11"]
[null,null,null,null,null,null,null,"2012-12-18","12/13","11/12","10/11",null,"2012-12-18","12/13","11/12","10/11"]
[null,null,null,null,null,null,null,"2012-12-19","12/13","11/12","10/11",null,"2012-12-19","12/13","11/12","10/11"]
[null,null,null,null,null,null,null,"2012-12-20","12/13","11/12","10/11",null,"2012-12-20","12/13","11/12","10/11"]
[null,null,null,null,null,null,null,"2012-12-21","12/13","11/12","10/11",null,"2012-12-21","12/13","11/12","10/11"]
[null,null,null,null,null,null,null,"2012-12-22","12/13","11/12","10/11",null,"2012-12-22","12/13","11/12","10/11"]
[null,null,null,null,null,null,null,"2012-12-23","12/13","11/12","10/11",null,"2012-12-23","12/13","11/12","10/11"]
[null,null,null,null,null,null,null,"2012-12-24","12/13","11/12","10/11",null,"2012-12-24","12/13","11/12","10/11"]
[null,null,null,null,null,null,null,"2012-12-25","12/13","11/12","10/11",null,"2012-12-25","12/13","11/12","10/11"]
[null,null,null,null,null,null,null,"2012-12-26","12/13","11/12","10/11",null,"2012-12-26","12/13","11/12","10/11"]
[null,null,null,null,null,null,null,"2012-12-27","12/13","11/12","10/11",null,"2012-12-27","12/13","11/12","10/11"]
[null,null,null,null,null,null,null,"2012-12-28","12/13","11/12","10/11",null,"2012-12-28","12/13","11/12","10/11"]
[null,null,null,null,null,null,null,"2012-12-29","12/13","11/12","10/11",null,"2012-12-29","12/13","11/12","10/11"]
[null,null,null,null,null,null,null,"2012-12-30","12/13","11/12","10/11",null,"2012-12-30","12/13","11/12","10/11"]
[null,null,null,null,null,null,null,"2012-12-31","12/13","11/12","10/11",null,"2012-12-31","12/13","11/12","10/11"]
[null,null,null,null,null,null,null,"2013-01-01","12/13","11/12","10/11",null,"2013-01-01","12/13","11/12","10/11"]
[null,null,null,null,null,null,null,"2013-01-02","12/13","11/12","10/11",null,"2013-01-02","12/13","11/12","10/11"]
[null,null,null,null,null,null,null,"2013-01-03","12/13","11/12","10/11",null,"2013-01-03","12/13","11/12","10/11"]
[null,null,null,null,null,null,null,"2013-01-04","12/13","11/12","10/11",null,"2013-01-04","12/13","11/12","10/11"]
[null,null,null,null,null,null,null,"2013-01-05","12/13","11/12","10/11",null,"2013-01-05","12/13","11/12","10/11"]
[null,null,null,null,null,null,null,"2013-01-06","12/13","11/12","10/11",null,"2013-01-06","12/13","11/12","10/11"]
[null,null,null,null,null,null,null,"2013-01-07","12/13","11/12","10/11",null,"2013-01-07","12/13","11/12","10/11"]
[null,null,null,null,null,null,null,"2013-01-08","12/13","11/12","10/11",null,"2013-01-08","12/13","11/12","10/11"]
[null,null,null,null,null,null,null,"2013-01-09","12/13","11/12","10/11",null,"2013-01-09","12/13","11/12","10/11"]
[null,null,null,null,null,null,null,"2013-01-10","12/13","11/12","10/11",null,"2013-01-10","12/13","11/12","10/11"]
[null,null,null,null,null,null,null,"2013-01-11","12/13","11/12","10/11",null,"2013-01-11","12/13","11/12","10/11"]
[null,null,null,null,null,null,null,"2013-01-12","12/13","11/12","10/11",null,"2013-01-12","12/13","11/12","10/11"]
[null,null,null,null,null,null,null,"2013-01-13","12/13","11/12","10/11",null,"2013-01-13","12/13","11/12","10/11"]
[null,null,null,null,null,null,null,"2013-01-14","12/13","11/12","10/11",null,"2013-01-14","12/13","11/12","10/11"]
[null,null,null,null,null,null,null,"2013-01-15","12/13","11/12","10/11",null,"2013-01-15","12/13","11/12","10/11"]
[null,null,null,null,null,null,null,"2013-01-16","12/13","11/12","10/11",null,"2013-01-16","12/13","11/12","10/11"]
[null,null,null,null,null,null,null,"2013-01-17","12/13","11/12","10/11",null,"2013-01-17","12/13","11/12","10/11"]
[null,null,null,null,null,null,null,"2013-01-18","12/13","11/12","10/11",null,"2013-01-18","12/13","11/12","10/11"]
[null,null,null,null,null,null,null,"2013-01-19","12/13","11/12","10/11",null,"2013-01-19","12/13","11/12","10/11"]
[null,null,null,null,null,null,null,"2013-01-20","12/13","11/12","10/11",null,"2013-01-20","12/13","11/12","10/11"]
[null,null,null,null,null,null,null,"2013-01-21","12/13","11/12","10/11",null,"2013-01-21","12/13","11/12","10/11"]
[null,null,null,null,null,null,null,"2013-01-22","12/13","11/12","10/11",null,"2013-01-22","12/13","11/12","10/11"]
[null,null,null,null,null,null,null,"2013-01-23","12/13","11/12","10/11",null,"2013-01-23","12/13","11/12","10/11"]
[null,null,null,null,null,null,null,"2013-01-24","12/13","11/12","10/11",null,"2013-01-24","12/13","11/12","10/11"]
[null,null,null,null,null,null,null,"2013-01-25","12/13","11/12","10/11",null,"2013-01-25","12/13","11/12","10/11"]
[null,null,null,null,null,null,null,"2013-01-26","12/13","11/12","10/11",null,"2013-01-26","12/13","11/12","10/11"]
[null,null,null,null,null,null,null,"2013-01-27","12/13","11/12","10/11",null,"2013-01-27","12/13","11/12","10/11"]
[null,null,null,null,null,null,null,"2013-01-28","12/13","11/12","10/11",null,"2013-01-28","12/13","11/12","10/11"]
[null,null,null,null,null,null,null,"2013-01-29","12/13","11/12","10/11",null,"2013-01-29","12/13","11/12","10/11"]
[null,null,null,null,null,null,null,"2013-01-30","12/13","11/12","10/11",null,"2013-01-30","12/13","11/12","10/11"]
[null,null,null,null,null,null,null,"2013-01-31","12/13","11/12","10/11",null,"2013-01-31","12/13","11/12","10/11"]
[null,null,null,null,null,null,null,"2013-02-01","12/13","11/12","10/11",null,"2013-02-01","12/13","11/12","10/11"]
[null,null,null,null,null,null,null,"2013-02-02","12/13","11/12","10/11",null,"2013-02-02","12/13","11/12","10/11"]
[null,null,null,null,null,null,null,"2013-02-03","12/13","11/12","10/11",null,"2013-02-03","12/13","11/12","10/11"]
[null,null,null,null,null,null,null,"2013-02-04","12/13","11/12","10/11",null,"2013-02-04","12/13","11/12","10/11"]
[null,null,null,null,null,null,null,"2013-02-05","12/13","11/12","10/11",null,"2013-02-05","12/13","11/12","10/11"]
[null,null,null,null,null,null,null,"2013-02-06","12/13","11/12","10/11",null,"2013-02-06","12/13","11/12","10/11"]
[null,null,null,null,null,null,null,"2013-02-07","12/13","11/12","10/11",null,"2013-02-07","12/13","11/12","10/11"]
[null,null,null,null,null,null,null,"2013-02-08","12/13","11/12","10/11",null,"2013-02-08","12/13","11/12","10/11"]
[null,null,null,null,null,null,null,"2013-02-09","12/13","11/12","10/11",null,"2013-02-09","12/13","11/12","10/11"]
[null,null,null,null,null,null,null,"2013-02-10","12/13","11/12","10/11",null,"2013-02-10","12/13","11/12","10/11"]
[null,null,null,null,null,null,null,"2013-02-11","12/13","11/12","10/11",null,"2013-02-11","12/13","11/12","10/11"]
[null,null,null,null,null,null,null,"2013-02-12","12/13","11/12","10/11",null,"2013-02-12","12/13","11/12","10/11"]
[null,null,null,null,null,null,null,"2013-02-13","12/13","11/12","10/11",null,"2013-02-13","12/13","11/12","10/11"]
[null,null,null,null,null,null,null,"2013-02-14","12/13","11/12","10/11",null,"2013-02-14","12/13","11/12","10/11"]
[null,null,null,null,null,null,null,"2013-02-15","12/13","11/12","10/11",null,"2013-02-15","12/13","11/12","10/11"]
[null,null,null,null,null,null,null,"2013-02-16","12/13","11/12","10/11",null,"2013-02-16","12/13","11/12","10/11"]
[null,null,null,null,null,null,null,"2013-02-17","12/13","11/12","10/11",null,"2013-02-17","12/13","11/12","10/11"]
[null,null,null,null,null,null,null,"2013-02-18","12/13","11/12","10/11",null,"2013-02-18","12/13","11/12","10/11"]
[null,null,null,null,null,null,null,"2013-02-19","12/13","11/12","10/11",null,"2013-02-19","12/13","11/12","10/11"]
[null,null,null,null,null,null,null,"2013-02-20","12/13","11/12","10/11",null,"2013-02-20","12/13","11/12","10/11"]
[null,null,null,null,null,null,null,"2013-02-21","12/13","11/12","10/11",null,"2013-02-21","12/13","11/12","10/11"]
[null,null,null,null,null,null,null,"2013-02-22","12/13","11/12","10/11",null,"2013-02-22","12/13","11/12","10/11"]
[null,null,null,null,null,null,null,"2013-02-23","12/13","11/12","10/11",null,"2013-02-23","12/13","11/12","10/11"]
[null,null,null,null,null,null,null,"2013-02-24","12/13","11/12","10/11",null,"2013-02-24","12/13","11/12","10/11"]
[null,null,null,null,null,null,null,"2013-02-25","12/13","11/12","10/11",null,"2013-02-25","12/13","11/12","10/11"]
[null,null,null,null,null,null,null,"2013-02-26","12/13","11/12","10/11",null,"2013-02-26","12/13","11/12","10/11"]
[null,null,null,null,null,null,null,"2013-02-27","12/13","11/12","10/11",null,"2013-02-27","12/13","11/12","10/11"]
[null,null,null,null,null,null,null,"2013-02-28","12/13","11/12","10/11",null,"2013-02-28","12/13","11/12","10/11"]
[null,null,null,null,null,null,null,"2013-03-01","12/13","11/12","10/11",null,"2013-03-01","12/13","11/12","10/11"]
[null,null,null,null,null,null,null,"2013-03-02","12/13","11/12","10/11",null,"2013-03-02","12/13","11/12","10/11"]
[null,null,null,null,null,null,null,"2013-03-03","12/13","11/12","10/11",null,"2013-03-03","12/13","11/12","10/11"]
[null,null,null,null,null,null,null,"2013-03-04","12/13","11/12","10/11",null,"2013-03-04","12/13","11/12","10/11"]
[null,null,null,null,null,null,null,"2013-03-05","12/13","11/12","10/11",null,"2013-03-05","12/13","11/12","10/11"]
[null,null,null,null,null,null,null,"2013-03-06","12/13","11/12","10/11",null,"2013-03-06","12/13","11/12","10/11"]
[null,null,null,null,null,null,null,"2013-03-07","12/13","11/12","10/11",null,"2013-03-07","12/13","11/12","10/11"]
[null,null,null,null,null,null,null,"2013-03-08","12/13","11/12","10/11",null,"2013-03-08","12/13","11/12","10/11"]
[null,null,null,null,null,null,null,"2013-03-09","12/13","11/12","10/11",null,"2013-03-09","12/13","11/12","10/11"]
[null,null,null,null,null,null,null,"2013-03-10","12/13","11/12","10/11",null,"2013-03-10","12/13","11/12","10/11"]
[null,null,null,null,null,null,null,"2013-03-11","12/13","11/12","10/11",null,"2013-03-11","12/13","11/12","10/11"]
[null,null,null,null,null,null,null,"2013-03-12","12/13","11/12","10/11",null,"2013-03-12","12/13","11/12","10/11"]
[null,null,null,null,null,null,null,"2013-03-13","12/13","11/12","10/11",null,"2013-03-13","12/13","11/12","10/11"]
[null,null,null,null,null,null,null,"2013-03-14","12/13","11/12","10/11",null,"2013-03-14","12/13","11/12","10/11"]
[null,null,null,null,null,null,null,"2013-03-15","12/13","11/12","10/11",null,"2013-03-15","12/13","11/12","10/11"]
[null,null,null,null,null,null,null,"2013-03-16","12/13","11/12","10/11",null,"2013-03-16","12/13","11/12","10/11"]
[null,null,null,null,null,null,null,"2013-03-17","12/13","11/12","10/11",null,"2013-03-17","12/13","11/12","10/11"]
[null,null,null,null,null,null,null,"2013-03-18","12/13","11/12","10/11",null,"2013-03-18","12/13","11/12","10/11"]
[null,null,null,null,null,null,null,"2013-03-19","12/13","11/12","10/11",null,"2013-03-19","12/13","11/12","10/11"]
[null,null,null,null,null,null,null,"2013-03-20","12/13","11/12","10/11",null,"2013-03-20","12/13","11/12","10/11"]
[null,null,null,null,null,null,null,"2013-03-21","12/13","11/12","10/11",null,"2013-03-21","12/13","11/12","10/11"]
[null,null,null,null,null,null,null,"2013-03-22","12/13","11/12","10/11",null,"2013-03-22","12/13","11/12","10/11"]
[null,null,null,null,null,null,null,"2013-03-23","12/13","11/12","10/11",null,"2013-03-23","12/13","11/12","10/11"]
[null,null,null,null,null,null,null,"2013-03-24","12/13","11/12","10/11",null,"2013-03-24","12/13","11/12","10/11"]
[null,null,null,null,null,null,null,"2013-03-25","12/13","11/12","10/11",null,"2013-03-25","12/13","11/12","10/11"]
[null,null,null,null,null,null,null,"2013-03-26","12/13","11/12","10/11",null,"2013-03-26","12/13","11/12","10/11"]
[null,null,null,null,null,null,null,"2013-03-27","12/13","11/12","10/11",null,"2013-03-27","12/13","11/12","10/11"]
[null,null,null,null,null,null,null,"2013-03-28","12/13","11/12","10/11",null,"2013-03-28","12/13","11/12","10/11"]
[null,null,null,null,null,null,null,"2013-03-29","12/13","11/12","10/11",null,"2013-03-29","12/13","11/12","10/11"]
[null,null,null,null,null,null,null,"2013-03-30","12/13","11/12","10/11",null,"2013-03-30","12/13","11/12","10/11"]
[null,null,null,null,null,null,null,"2013-03-31","12/13","11/12","10/11",null,"2013-03-31","12/13","11/12","10/11"]
[null,null,null,null,null,null,null,"2013-04-01","12/13","11/12","10/11",null,"2013-04-01","12/13","11/12","10/11"]
[null,null,null,null,null,null,null,"2013-04-02","12/13","11/12","10/11",null,"2013-04-02","12/13","11/12","10/11"]
[null,null,null,null,null,null,null,"2013-04-03","12/13","11/12","10/11",null,"2013-04-03","12/13","11/12","10/11"]
[null,null,null,null,null,null,null,"2013-04-04","12/13","11/12","10/11",null,"2013-04-04","12/13","11/12","10/11"]
[null,null,null,null,null,null,null,"2013-04-05","12/13","11/12","11/12",null,"2013-04-05","12/13","11/12","11/12"]
[null,null,null,null,null,null,null,"2013-04-06","13/14","12/13","11/12",null,"2013-04-06","13/14","12/13","11/12"]
[null,null,null,null,null,null,null,"2013-04-07","13/14","12/13","11/12",null,"2013-04-07","13/14","12/13","11/12"]
[null,null,null,null,null,null,null,"2013-04-08","13/14","12/13","11/12",null,"2013-04-08","13/14","12/13","11/12"]
[null,null,null,null,null,null,null,"2013-04-09","13/14","12/13","11/12",null,"2013-04-09","13/14","12/13","11/12"]
[null,null,null,null,null,null,null,"2013-04-10","13/14","12/13","11/12",null,"2013-04-10","13/14","12/13","11/12"]
[null,null,null,null,null,null,null,"2013-04-11","13/14","12/13","11/12",null,"2013-04-11","13/14","12/13","11/12"]
[null,null,null,null,null,null,null,"2013-04-12","13/14","12/13","11/12",null,"2013-04-12","13/14","12/13","11/12"]
[null,null,null,null,null,null,null,"2013-04-13","13/14","12/13","11/12",null,"2013-04-13","13/14","12/13","11/12"]
[null,null,null,null,null,null,null,"2013-04-14","13/14","12/13","11/12",null,"2013-04-14","13/14","12/13","11/12"]
[null,null,null,null,null,null,null,"2013-04-15","13/14","12/13","11/12",null,"2013-04-15","13/14","12/13","11/12"]
[null,null,null,null,null,null,null,"2013-04-16","13/14","12/13","11/12",null,"2013-04-16","13/14","12/13","11/12"]
[null,null,null,null,null,null,null,"2013-04-17","13/14","12/13","11/12",null,"2013-04-17","13/14","12/13","11/12"]
[null,null,null,null,null,null,null,"2013-04-18","13/14","12/13","11/12",null,"2013-04-18","13/14","12/13","11/12"]
[null,null,null,null,null,null,null,"2013-04-19","13/14","12/13","11/12",null,"2013-04-19","13/14","12/13","11/12"]
[null,null,null,null,null,null,null,"2013-04-20","13/14","12/13","11/12",null,"2013-04-20","13/14","12/13","11/12"]
[null,null,null,null,null,null,null,"2013-04-21","13/14","12/13","11/12",null,"2013-04-21","13/14","12/13","11/12"]
[null,null,null,null,null,null,null,"2013-04-22","13/14","12/13","11/12",null,"2013-04-22","13/14","12/13","11/12"]
[null,null,null,null,null,null,null,"2013-04-23","13/14","12/13","11/12",null,"2013-04-23","13/14","12/13","11/12"]
[null,null,null,null,null,null,null,"2013-04-24","13/14","12/13","11/12",null,"2013-04-24","13/14","12/13","11/12"]
[null,null,null,null,null,null,null,"2013-04-25","13/14","12/13","11/12",null,"2013-04-25","13/14","12/13","11/12"]
[null,null,null,null,null,null,null,"2013-04-26","13/14","12/13","11/12",null,"2013-04-26","13/14","12/13","11/12"]
[null,null,null,null,null,null,null,"2013-04-27","13/14","12/13","11/12",null,"2013-04-27","13/14","12/13","11/12"]
[null,null,null,null,null,null,null,"2013-04-28","13/14","12/13","11/12",null,"2013-04-28","13/14","12/13","11/12"]
[null,null,null,null,null,null,null,"2013-04-29","13/14","12/13","11/12",null,"2013-04-29","13/14","12/13","11/12"]
[null,null,null,null,null,null,null,"2013-04-30","13/14","12/13","11/12",null,"2013-04-30","13/14","12/13","11/12"]
[null,null,null,null,null,null,null,"2013-05-01","13/14","12/13","11/12",null,"2013-05-01","13/14","12/13","11/12"]
[null,null,null,null,null,null,null,"2013-05-02","13/14","12/13","11/12",null,"2013-05-02","13/14","12/13","11/12"]
[null,null,null,null,null,null,null,"2013-05-03","13/14","12/13","11/12",null,"2013-05-03","13/14","12/13","11/12"]
[null,null,null,null,null,null,null,"2013-05-04","13/14","12/13","11/12",null,"2013-05-04","13/14","12/13","11/12"]
[null,null,null,null,null,null,null,"2013-05-05","13/14","12/13","11/12",null,"2013-05-05","13/14","12/13","11/12"]
[null,null,null,null,null,null,null,"2013-05-06","13/14","12/13","11/12",null,"2013-05-06","13/14","12/13","11/12"]
[null,null,null,null,null,null,null,"2013-05-07","13/14","12/13","11/12",null,"2013-05-07","13/14","12/13","11/12"]
[null,null,null,null,null,null,null,"2013-05-08","13/14","12/13","11/12",null,"2013-05-08","13/14","12/13","11/12"]
[null,null,null,null,null,null,null,"2013-05-09","13/14","12/13","11/12",null,"2013-05-09","13/14","12/13","11/12"]
[null,null,null,null,null,null,null,"2013-05-10","13/14","12/13","11/12",null,"2013-05-10","13/14","12/13","11/12"]
[null,null,null,null,null,null,null,"2013-05-11","13/14","12/13","11/12",null,"2013-05-11","13/14","12/13","11/12"]
[null,null,null,null,null,null,null,"2013-05-12","13/14","12/13","11/12",null,"2013-05-12","13/14","12/13","11/12"]
[null,null,null,null,null,null,null,"2013-05-13","13/14","12/13","11/12",null,"2013-05-13","13/14","12/13","11/12"]
[null,null,null,null,null,null,null,"2013-05-14","13/14","12/13","11/12",null,"2013-05-14","13/14","12/13","11/12"]
[null,null,null,null,null,null,null,"2013-05-15","13/14","12/13","11/12",null,"2013-05-15","13/14","12/13","11/12"]
[null,null,null,null,null,null,null,"2013-05-16","13/14","12/13","11/12",null,"2013-05-16","13/14","12/13","11/12"]
[null,null,null,null,null,null,null,"2013-05-17","13/14","12/13","11/12",null,"2013-05-17","13/14","12/13","11/12"]
[null,null,null,null,null,null,null,"2013-05-18","13/14","12/13","11/12",null,"2013-05-18","13/14","12/13","11/12"]
[null,null,null,null,null,null,null,"2013-05-19","13/14","12/13","11/12",null,"2013-05-19","13/14","12/13","11/12"]
[null,null,null,null,null,null,null,"2013-05-20","13/14","12/13","11/12",null,"2013-05-20","13/14","12/13","11/12"]
[null,null,null,null,null,null,null,"2013-05-21","13/14","12/13","11/12",null,"2013-05-21","13/14","12/13","11/12"]
[null,null,null,null,null,null,null,"2013-05-22","13/14","12/13","11/12",null,"2013-05-22","13/14","12/13","11/12"]
[null,null,null,null,null,null,null,"2013-05-23","13/14","12/13","11/12",null,"2013-05-23","13/14","12/13","11/12"]
[null,null,null,null,null,null,null,"2013-05-24","13/14","12/13","11/12",null,"2013-05-24","13/14","12/13","11/12"]
[null,null,null,null,null,null,null,"2013-05-25","13/14","12/13","11/12",null,"2013-05-25","13/14","12/13","11/12"]
[null,null,null,null,null,null,null,"2013-05-26","13/14","12/13","11/12",null,"2013-05-26","13/14","12/13","11/12"]
[null,null,null,null,null,null,null,"2013-05-27","13/14","12/13","11/12",null,"2013-05-27","13/14","12/13","11/12"]
[null,null,null,null,null,null,null,"2013-05-28","13/14","12/13","11/12",null,"2013-05-28","13/14","12/13","11/12"]
[null,null,null,null,null,null,null,"2013-05-29","13/14","12/13","11/12",null,"2013-05-29","13/14","12/13","11/12"]
[null,null,null,null,null,null,null,"2013-05-30","13/14","12/13","11/12",null,"2013-05-30","13/14","12/13","11/12"]
[null,null,null,null,null,null,null,"2013-05-31","13/14","12/13","11/12",null,"2013-05-31","13/14","12/13","11/12"]
[null,null,null,null,null,null,null,"2013-06-01","13/14","12/13","11/12",null,"2013-06-01","13/14","12/13","11/12"]
[null,null,null,null,null,null,null,"2013-06-02","13/14","12/13","11/12",null,"2013-06-02","13/14","12/13","11/12"]
[null,null,null,null,null,null,null,"2013-06-03","13/14","12/13","11/12",null,"2013-06-03","13/14","12/13","11/12"]
[null,null,null,null,null,null,null,"2013-06-04","13/14","12/13","11/12",null,"2013-06-04","13/14","12/13","11/12"]
[null,null,null,null,null,null,null,"2013-06-05","13/14","12/13","11/12",null,"2013-06-05","13/14","12/13","11/12"]
[null,null,null,null,null,null,null,"2013-06-06","13/14","12/13","11/12",null,"2013-06-06","13/14","12/13","11/12"]
[null,null,null,null,null,null,null,"2013-06-07","13/14","12/13","11/12",null,"2013-06-07","13/14","12/13","11/12"]
[null,null,null,null,null,null,null,"2013-06-08","13/14","12/13","11/12",null,"2013-06-08","13/14","12/13","11/12"]
[null,null,null,null,null,null,null,"2013-06-09","13/14","12/13","11/12",null,"2013-06-09","13/14","12/13","11/12"]
[null,null,null,null,null,null,null,"2013-06-10","13/14","12/13","11/12",null,"2013-06-10","13/14","12/13","11/12"]
[null,null,null,null,null,null,null,"2013-06-11","13/14","12/13","11/12",null,"2013-06-11","13/14","12/13","11/12"]
[null,null,null,null,null,null,null,"2013-06-12","13/14","12/13","11/12",null,"2013-06-12","13/14","12/13","11/12"]
[null,null,null,null,null,null,null,"2013-06-13","13/14","12/13","11/12",null,"2013-06-13","13/14","12/13","11/12"]
[null,null,null,null,null,null,null,"2013-06-14","13/14","12/13","11/12",null,"2013-06-14","13/14","12/13","11/12"]
[null,null,null,null,null,null,null,"2013-06-15","13/14","12/13","11/12",null,"2013-06-15","13/14","12/13","11/12"]
[null,null,null,null,null,null,null,"2013-06-16","13/14","12/13","11/12",null,"2013-06-16","13/14","12/13","11/12"]
[null,null,null,null,null,null,null,"2013-06-17","13/14","12/13","11/12",null,"2013-06-17","13/14","12/13","11/12"]
[null,null,null,null,null,null,null,"2013-06-18","13/14","12/13","11/12",null,"2013-06-18","13/14","12/13","11/12"]
[null,null,null,null,null,null,null,"2013-06-19","13/14","12/13","11/12",null,"2013-06-19","13/14","12/13","11/12"]
[null,null,null,null,null,null,null,"2013-06-20","13/14","12/13","11/12",null,"2013-06-20","13/14","12/13","11/12"]
[null,null,null,null,null,null,null,"2013-06-21","13/14","12/13","11/12",null,"2013-06-21","13/14","12/13","11/12"]
[null,null,null,null,null,null,null,"2013-06-22","13/14","12/13","11/12",null,"2013-06-22","13/14","12/13","11/12"]
[null,null,null,null,null,null,null,"2013-06-23","13/14","12/13","11/12",null,"2013-06-23","13/14","12/13","11/12"]
[null,null,null,null,null,null,null,"2013-06-24","13/14","12/13","11/12",null,"2013-06-24","13/14","12/13","11/12"]
[null,null,null,null,null,null,null,"2013-06-25","13/14","12/13","11/12",null,"2013-06-25","13/14","12/13","11/12"]
[null,null,null,null,null,null,null,"2013-06-26","13/14","12/13","11/12",null,"2013-06-26","13/14","12/13","11/12"]
[null,null,null,null,null,null,null,"2013-06-27","13/14","12/13","11/12",null,"2013-06-27","13/14","12/13","11/12"]
[null,null,null,null,null,null,null,"2013-06-28","13/14","12/13","11/12",null,"2013-06-28","13/14","12/13","11/12"]
[null,null,null,null,null,null,null,"2013-06-29","13/14","12/13","11/12",null,"2013-06-29","13/14","12/13","11/12"]
[null,null,null,null,null,null,null,"2013-06-30","13/14","12/13","11/12",null,"2013-06-30","13/14","12/13","11/12"]
[null,null,null,null,null,null,null,"2013-07-01","13/14","12/13","11/12",null,"2013-07-01","13/14","12/13","11/12"]
[null,null,null,null,null,null,null,"2013-07-02","13/14","12/13","11/12",null,"2013-07-02","13/14","12/13","11/12"]
[null,null,null,null,null,null,null,"2013-07-03","13/14","12/13","11/12",null,"2013-07-03","13/14","12/13","11/12"]
[null,null,null,null,null,null,null,"2013-07-04","13/14","12/13","11/12",null,"2013-07-04","13/14","12/13","11/12"]
[null,null,null,null,null,null,null,"2013-07-05","13/14","12/13","11/12",null,"2013-07-05","13/14","12/13","11/12"]
[null,null,null,null,null,null,null,"2013-07-06","13/14","12/13","11/12",null,"2013-07-06","13/14","12/13","11/12"]
[null,null,null,null,null,null,null,"2013-07-07","13/14","12/13","11/12",null,"2013-07-07","13/14","12/13","11/12"]
[null,null,null,null,null,null,null,"2013-07-08","13/14","12/13","11/12",null,"2013-07-08","13/14","12/13","11/12"]
[null,null,null,null,null,null,null,"2013-07-09","13/14","12/13","11/12",null,"2013-07-09","13/14","12/13","11/12"]
[null,null,null,null,null,null,null,"2013-07-10","13/14","12/13","11/12",null,"2013-07-10","13/14","12/13","11/12"]
[null,null,null,null,null,null,null,"2013-07-11","13/14","12/13","11/12",null,"2013-07-11","13/14","12/13","11/12"]
[null,null,null,null,null,null,null,"2013-07-12","13/14","12/13","11/12",null,"2013-07-12","13/14","12/13","11/12"]
[null,null,null,null,null,null,null,"2013-07-13","13/14","12/13","11/12",null,"2013-07-13","13/14","12/13","11/12"]
[null,null,null,null,null,null,null,"2013-07-14","13/14","12/13","11/12",null,"2013-07-14","13/14","12/13","11/12"]
[null,null,null,null,null,null,null,"2013-07-15","13/14","12/13","11/12",null,"2013-07-15","13/14","12/13","11/12"]
[null,null,null,null,null,null,null,"2013-07-16","13/14","12/13","11/12",null,"2013-07-16","13/14","12/13","11/12"]
[null,null,null,null,null,null,null,"2013-07-17","13/14","12/13","11/12",null,"2013-07-17","13/14","12/13","11/12"]
[null,null,null,null,null,null,null,"2013-07-18","13/14","12/13","11/12",null,"2013-07-18","13/14","12/13","11/12"]
[null,null,null,null,null,null,null,"2013-07-19","13/14","12/13","11/12",null,"2013-07-19","13/14","12/13","11/12"]
[null,null,null,null,null,null,null,"2013-07-20","13/14","12/13","11/12",null,"2013-07-20","13/14","12/13","11/12"]
[null,null,null,null,null,null,null,"2013-07-21","13/14","12/13","11/12",null,"2013-07-21","13/14","12/13","11/12"]
[null,null,null,null,null,null,null,"2013-07-22","13/14","12/13","11/12",null,"2013-07-22","13/14","12/13","11/12"]
[null,null,null,null,null,null,null,"2013-07-23","13/14","12/13","11/12",null,"2013-07-23","13/14","12/13","11/12"]
[null,null,null,null,null,null,null,"2013-07-24","13/14","12/13","11/12",null,"2013-07-24","13/14","12/13","11/12"]
[null,null,null,null,null,null,null,"2013-07-25","13/14","12/13","11/12",null,"2013-07-25","13/14","12/13","11/12"]
[null,null,null,null,null,null,null,"2013-07-26","13/14","12/13","11/12",null,"2013-07-26","13/14","12/13","11/12"]
[null,null,null,null,null,null,null,"2013-07-27","13/14","12/13","11/12",null,"2013-07-27","13/14","12/13","11/12"]
[null,null,null,null,null,null,null,"2013-07-28","13/14","12/13","11/12",null,"2013-07-28","13/14","12/13","11/12"]
[null,null,null,null,null,null,null,"2013-07-29","13/14","12/13","11/12",null,"2013-07-29","13/14","12/13","11/12"]
[null,null,null,null,null,null,null,"2013-07-30","13/14","12/13","11/12",null,"2013-07-30","13/14","12/13","11/12"]
[null,null,null,null,null,null,null,"2013-07-31","13/14","12/13","11/12",null,"2013-07-31","13/14","12/13","11/12"]
[null,null,null,null,null,null,null,"2013-08-01","13/14","12/13","11/12",null,"2013-08-01","13/14","12/13","11/12"]
[null,null,null,null,null,null,null,"2013-08-02","13/14","12/13","11/12",null,"2013-08-02","13/14","12/13","11/12"]
[null,null,null,null,null,null,null,"2013-08-03","13/14","12/13","11/12",null,"2013-08-03","13/14","12/13","11/12"]
[null,null,null,null,null,null,null,"2013-08-04","13/14","12/13","11/12",null,"2013-08-04","13/14","12/13","11/12"]
[null,null,null,null,null,null,null,"2013-08-05","13/14","12/13","11/12",null,"2013-08-05","13/14","12/13","11/12"]
[null,null,null,null,null,null,null,"2013-08-06","13/14","12/13","11/12",null,"2013-08-06","13/14","12/13","11/12"]
[null,null,null,null,null,null,null,"2013-08-07","13/14","12/13","11/12",null,"2013-08-07","13/14","12/13","11/12"]
[null,null,null,null,null,null,null,"2013-08-08","13/14","12/13","11/12",null,"2013-08-08","13/14","12/13","11/12"]
[null,null,null,null,null,null,null,"2013-08-09","13/14","12/13","11/12",null,"2013-08-09","13/14","12/13","11/12"]
[null,null,null,null,null,null,null,"2013-08-10","13/14","12/13","11/12",null,"2013-08-10","13/14","12/13","11/12"]
[null,null,null,null,null,null,null,"2013-08-11","13/14","12/13","11/12",null,"2013-08-11","13/14","12/13","11/12"]
[null,null,null,null,null,null,null,"2013-08-12","13/14","12/13","11/12",null,"2013-08-12","13/14","12/13","11/12"]
[null,null,null,null,null,null,null,"2013-08-13","13/14","12/13","11/12",null,"2013-08-13","13/14","12/13","11/12"]
[null,null,null,null,null,null,null,"2013-08-14","13/14","12/13","11/12",null,"2013-08-14","13/14","12/13","11/12"]
[null,null,null,null,null,null,null,"2013-08-15","13/14","12/13","11/12",null,"2013-08-15","13/14","12/13","11/12"]
[null,null,null,null,null,null,null,"2013-08-16","13/14","12/13","11/12",null,"2013-08-16","13/14","12/13","11/12"]
[null,null,null,null,null,null,null,"2013-08-17","13/14","12/13","11/12",null,"2013-08-17","13/14","12/13","11/12"]
[null,null,null,null,null,null,null,"2013-08-18","13/14","12/13","11/12",null,"2013-08-18","13/14","12/13","11/12"]
[null,null,null,null,null,null,null,"2013-08-19","13/14","12/13","11/12",null,"2013-08-19","13/14","12/13","11/12"]
[null,null,null,null,null,null,null,"2013-08-20","13/14","12/13","11/12",null,"2013-08-20","13/14","12/13","11/12"]
[null,null,null,null,null,null,null,"2013-08-21","13/14","12/13","11/12",null,"2013-08-21","13/14","12/13","11/12"]
[null,null,null,null,null,null,null,"2013-08-22","13/14","12/13","11/12",null,"2013-08-22","13/14","12/13","11/12"]
[null,null,null,null,null,null,null,"2013-08-23","13/14","12/13","11/12",null,"2013-08-23","13/14","12/13","11/12"]
[null,null,null,null,null,null,null,"2013-08-24","13/14","12/13","11/12",null,"2013-08-24","13/14","12/13","11/12"]
[null,null,null,null,null,null,null,"2013-08-25","13/14","12/13","11/12",null,"2013-08-25","13/14","12/13","11/12"]
[null,null,null,null,null,null,null,"2013-08-26","13/14","12/13","11/12",null,"2013-08-26","13/14","12/13","11/12"]
[null,null,null,null,null,null,null,"2013-08-27","13/14","12/13","11/12",null,"2013-08-27","13/14","12/13","11/12"]
[null,null,null,null,null,null,null,"2013-08-28","13/14","12/13","11/12",null,"2013-08-28","13/14","12/13","11/12"]
[null,null,null,null,null,null,null,"2013-08-29","13/14","12/13","11/12",null,"2013-08-29","13/14","12/13","11/12"]
[null,null,null,null,null,null,null,"2013-08-30","13/14","12/13","11/12",null,"2013-08-30","13/14","12/13","11/12"]
[null,null,null,null,null,null,null,"2013-08-31","13/14","12/13","11/12",null,"2013-08-31","13/14","12/13","11/12"]
[null,null,null,null,null,null,null,"2013-09-01","13/14","12/13","11/12",null,"2013-09-01","13/14","12/13","11/12"]
[null,null,null,null,null,null,null,"2013-09-02","13/14","12/13","11/12",null,"2013-09-02","13/14","12/13","11/12"]
[null,null,null,null,null,null,null,"2013-09-03","13/14","12/13","11/12",null,"2013-09-03","13/14","12/13","11/12"]
[null,null,null,null,null,null,null,"2013-09-04","13/14","12/13","11/12",null,"2013-09-04","13/14","12/13","11/12"]
[null,null,null,null,null,null,null,"2013-09-05","13/14","12/13","11/12",null,"2013-09-05","13/14","12/13","11/12"]
[null,null,null,null,null,null,null,"2013-09-06","13/14","12/13","11/12",null,"2013-09-06","13/14","12/13","11/12"]
[null,null,null,null,null,null,null,"2013-09-07","13/14","12/13","11/12",null,"2013-09-07","13/14","12/13","11/12"]
[null,null,null,null,null,null,null,"2013-09-08","13/14","12/13","11/12",null,"2013-09-08","13/14","12/13","11/12"]
[null,null,null,null,null,null,null,"2013-09-09","13/14","12/13","11/12",null,"2013-09-09","13/14","12/13","11/12"]
[null,null,null,null,null,null,null,"2013-09-10","13/14","12/13","11/12",null,"2013-09-10","13/14","12/13","11/12"]
[null,null,null,null,null,null,null,"2013-09-11","13/14","12/13","11/12",null,"2013-09-11","13/14","12/13","11/12"]
[null,null,null,null,null,null,null,"2013-09-12","13/14","12/13","11/12",null,"2013-09-12","13/14","12/13","11/12"]
[null,null,null,null,null,null,null,"2013-09-13","13/14","12/13","11/12",null,"2013-09-13","13/14","12/13","11/12"]
[null,null,null,null,null,null,null,"2013-09-14","13/14","12/13","11/12",null,"2013-09-14","13/14","12/13","11/12"]
[null,null,null,null,null,null,null,"2013-09-15","13/14","12/13","11/12",null,"2013-09-15","13/14","12/13","11/12"]
[null,null,null,null,null,null,null,"2013-09-16","13/14","12/13","11/12",null,"2013-09-16","13/14","12/13","11/12"]
[null,null,null,null,null,null,null,"2013-09-17","13/14","12/13","11/12",null,"2013-09-17","13/14","12/13","11/12"]
[null,null,null,null,null,null,null,"2013-09-18","13/14","12/13","11/12",null,"2013-09-18","13/14","12/13","11/12"]
[null,null,null,null,null,null,null,"2013-09-19","13/14","12/13","11/12",null,"2013-09-19","13/14","12/13","11/12"]
[null,null,null,null,null,null,null,"2013-09-20","13/14","12/13","11/12",null,"2013-09-20","13/14","12/13","11/12"]
[null,null,null,null,null,null,null,"2013-09-21","13/14","12/13","11/12",null,"2013-09-21","13/14","12/13","11/12"]
[null,null,null,null,null,null,null,"2013-09-22","13/14","12/13","11/12",null,"2013-09-22","13/14","12/13","11/12"]
[null,null,null,null,null,null,null,"2013-09-23","13/14","12/13","11/12",null,"2013-09-23","13/14","12/13","11/12"]
[null,null,null,null,null,null,null,"2013-09-24","13/14","12/13","11/12",null,"2013-09-24","13/14","12/13","11/12"]
[null,null,null,null,null,null,null,"2013-09-25","13/14","12/13","11/12",null,"2013-09-25","13/14","12/13","11/12"]
[null,null,null,null,null,null,null,"2013-09-26","13/14","12/13","11/12",null,"2013-09-26","13/14","12/13","11/12"]
[null,null,null,null,null,null,null,"2013-09-27","13/14","12/13","11/12",null,"2013-09-27","13/14","12/13","11/12"]
[null,null,null,null,null,null,null,"2013-09-28","13/14","12/13","11/12",null,"2013-09-28","13/14","12/13","11/12"]
[null,null,null,null,null,null,null,"2013-09-29","13/14","12/13","11/12",null,"2013-09-29","13/14","12/13","11/12"]
[null,null,null,null,null,null,null,"2013-09-30","13/14","12/13","11/12",null,"2013-09-30","13/14","12/13","11/12"]
[null,null,null,null,null,null,null,"2013-10-01","13/14","12/13","11/12",null,"2013-10-01","13/14","12/13","11/12"]
[null,null,null,null,null,null,null,"2013-10-02","13/14","12/13","11/12",null,"2013-10-02","13/14","12/13","11/12"]
[null,null,null,null,null,null,null,"2013-10-03","13/14","12/13","11/12",null,"2013-10-03","13/14","12/13","11/12"]
[null,null,null,null,null,null,null,"2013-10-04","13/14","12/13","11/12",null,"2013-10-04","13/14","12/13","11/12"]
[null,null,null,null,null,null,null,"2013-10-05","13/14","12/13","11/12",null,"2013-10-05","13/14","12/13","11/12"]
[null,null,null,null,null,null,null,"2013-10-06","13/14","12/13","11/12",null,"2013-10-06","13/14","12/13","11/12"]
[null,null,null,null,null,null,null,"2013-10-07","13/14","12/13","11/12",null,"2013-10-07","13/14","12/13","11/12"]
[null,null,null,null,null,null,null,"2013-10-08","13/14","12/13","11/12",null,"2013-10-08","13/14","12/13","11/12"]
[null,null,null,null,null,null,null,"2013-10-09","13/14","12/13","11/12",null,"2013-10-09","13/14","12/13","11/12"]
[null,null,null,null,null,null,null,"2013-10-10","13/14","12/13","11/12",null,"2013-10-10","13/14","12/13","11/12"]
[null,null,null,null,null,null,null,"2013-10-11","13/14","12/13","11/12",null,"2013-10-11","13/14","12/13","11/12"]
[null,null,null,null,null,null,null,"2013-10-12","13/14","12/13","11/12",null,"2013-10-12","13/14","12/13","11/12"]
[null,null,null,null,null,null,null,"2013-10-13","13/14","12/13","11/12",null,"2013-10-13","13/14","12/13","11/12"]
[null,null,null,null,null,null,null,"2013-10-14","13/14","12/13","11/12",null,"2013-10-14","13/14","12/13","11/12"]
[null,null,null,null,null,null,null,"2013-10-15","13/14","12/13","11/12",null,"2013-10-15","13/14","12/13","11/12"]
[null,null,null,null,null,null,null,"2013-10-16","13/14","12/13","11/12",null,"2013-10-16","13/14","12/13","11/12"]
[null,null,null,null,null,null,null,"2013-10-17","13/14","12/13","11/12",null,"2013-10-17","13/14","12/13","11/12"]
[null,null,null,null,null,null,null,"2013-10-18","13/14","12/13","11/12",null,"2013-10-18","13/14","12/13","11/12"]
[null,null,null,null,null,null,null,"2013-10-19","13/14","12/13","11/12",null,"2013-10-19","13/14","12/13","11/12"]
[null,null,null,null,null,null,null,"2013-10-20","13/14","12/13","11/12",null,"2013-10-20","13/14","12/13","11/12"]
[null,null,null,null,null,null,null,"2013-10-21","13/14","12/13","11/12",null,"2013-10-21","13/14","12/13","11/12"]
[null,null,null,null,null,null,null,"2013-10-22","13/14","12/13","11/12",null,"2013-10-22","13/14","12/13","11/12"]
[null,null,null,null,null,null,null,"2013-10-23","13/14","12/13","11/12",null,"2013-10-23","13/14","12/13","11/12"]
[null,null,null,null,null,null,null,"2013-10-24","13/14","12/13","11/12",null,"2013-10-24","13/14","12/13","11/12"]
[null,null,null,null,null,null,null,"2013-10-25","13/14","12/13","11/12",null,"2013-10-25","13/14","12/13","11/12"]
[null,null,null,null,null,null,null,"2013-10-26","13/14","12/13","11/12",null,"2013-10-26","13/14","12/13","11/12"]
[null,null,null,null,null,null,null,"2013-10-27","13/14","12/13","11/12",null,"2013-10-27","13/14","12/13","11/12"]
[null,null,null,null,null,null,null,"2013-10-28","13/14","12/13","11/12",null,"2013-10-28","13/14","12/13","11/12"]
[null,null,null,null,null,null,null,"2013-10-29","13/14","12/13","11/12",null,"2013-10-29","13/14","12/13","11/12"]
[null,null,null,null,null,null,null,"2013-10-30","13/14","12/13","11/12",null,"2013-10-30","13/14","12/13","11/12"]
[null,null,null,null,null,null,null,"2013-10-31","13/14","12/13","11/12",null,"2013-10-31","13/14","12/13","11/12"]
[null,null,null,null,null,null,null,"2013-11-01","13/14","12/13","11/12",null,"2013-11-01","13/14","12/13","11/12"]
[null,null,null,null,null,null,null,"2013-11-02","13/14","12/13","11/12",null,"2013-11-02","13/14","12/13","11/12"]
[null,null,null,null,null,null,null,"2013-11-03","13/14","12/13","11/12",null,"2013-11-03","13/14","12/13","11/12"]
[null,null,null,null,null,null,null,"2013-11-04","13/14","12/13","11/12",null,"2013-11-04","13/14","12/13","11/12"]
[null,null,null,null,null,null,null,"2013-11-05","13/14","12/13","11/12",null,"2013-11-05","13/14","12/13","11/12"]
[null,null,null,null,null,null,null,"2013-11-06","13/14","12/13","11/12",null,"2013-11-06","13/14","12/13","11/12"]
[null,null,null,null,null,null,null,"2013-11-07","13/14","12/13","11/12",null,"2013-11-07","13/14","12/13","11/12"]
[null,null,null,null,null,null,null,"2013-11-08","13/14","12/13","11/12",null,"2013-11-08","13/14","12/13","11/12"]
[null,null,null,null,null,null,null,"2013-11-09","13/14","12/13","11/12",null,"2013-11-09","13/14","12/13","11/12"]
[null,null,null,null,null,null,null,"2013-11-10","13/14","12/13","11/12",null,"2013-11-10","13/14","12/13","11/12"]
[null,null,null,null,null,null,null,"2013-11-11","13/14","12/13","11/12",null,"2013-11-11","13/14","12/13","11/12"]
[null,null,null,null,null,null,null,"2013-11-12","13/14","12/13","11/12",null,"2013-11-12","13/14","12/13","11/12"]
[null,null,null,null,null,null,null,"2013-11-13","13/14","12/13","11/12",null,"2013-11-13","13/14","12/13","11/12"]
[null,null,null,null,null,null,null,"2013-11-14","13/14","12/13","11/12",null,"2013-11-14","13/14","12/13","11/12"]
[null,null,null,null,null,null,null,"2013-11-15","13/14","12/13","11/12",null,"2013-11-15","13/14","12/13","11/12"]
[null,null,null,null,null,null,null,"2013-11-16","13/14","12/13","11/12",null,"2013-11-16","13/14","12/13","11/12"]
[null,null,null,null,null,null,null,"2013-11-17","13/14","12/13","11/12",null,"2013-11-17","13/14","12/13","11/12"]
[null,null,null,null,null,null,null,"2013-11-18","13/14","12/13","11/12",null,"2013-11-18","13/14","12/13","11/12"]
[null,null,null,null,null,null,null,"2013-11-19","13/14","12/13","11/12",null,"2013-11-19","13/14","12/13","11/12"]
[null,null,null,null,null,null,null,"2013-11-20","13/14","12/13","11/12",null,"2013-11-20","13/14","12/13","11/12"]
[null,null,null,null,null,null,null,"2013-11-21","13/14","12/13","11/12",null,"2013-11-21","13/14","12/13","11/12"]
[null,null,null,null,null,null,null,"2013-11-22","13/14","12/13","11/12",null,"2013-11-22","13/14","12/13","11/12"]
[null,null,null,null,null,null,null,"2013-11-23","13/14","12/13","11/12",null,"2013-11-23","13/14","12/13","11/12"]
[null,null,null,null,null,null,null,"2013-11-24","13/14","12/13","11/12",null,"2013-11-24","13/14","12/13","11/12"]
[null,null,null,null,null,null,null,"2013-11-25","13/14","12/13","11/12",null,"2013-11-25","13/14","12/13","11/12"]
[null,null,null,null,null,null,null,"2013-11-26","13/14","12/13","11/12",null,"2013-11-26","13/14","12/13","11/12"]
[null,null,null,null,null,null,null,"2013-11-27","13/14","12/13","11/12",null,"2013-11-27","13/14","12/13","11/12"]
[null,null,null,null,null,null,null,"2013-11-28","13/14","12/13","11/12",null,"2013-11-28","13/14","12/13","11/12"]
[null,null,null,null,null,null,null,"2013-11-29","13/14","12/13","11/12",null,"2013-11-29","13/14","12/13","11/12"]
[null,null,null,null,null,null,null,"2013-11-30","13/14","12/13","11/12",null,"2013-11-30","13/14","12/13","11/12"]
[null,null,null,null,null,null,null,"2013-12-01","13/14","12/13","11/12",null,"2013-12-01","13/14","12/13","11/12"]
[null,null,null,null,null,null,null,"2013-12-02","13/14","12/13","11/12",null,"2013-12-02","13/14","12/13","11/12"]
[null,null,null,null,null,null,null,"2013-12-03","13/14","12/13","11/12",null,"2013-12-03","13/14","12/13","11/12"]
[null,null,null,null,null,null,null,"2013-12-04","13/14","12/13","11/12",null,"2013-12-04","13/14","12/13","11/12"]
[null,null,null,null,null,null,null,"2013-12-05","13/14","12/13","11/12",null,"2013-12-05","13/14","12/13","11/12"]
[null,null,null,null,null,null,null,"2013-12-06","13/14","12/13","11/12",null,"2013-12-06","13/14","12/13","11/12"]
[null,null,null,null,null,null,null,"2013-12-07","13/14","12/13","11/12",null,"2013-12-07","13/14","12/13","11/12"]
[null,null,null,null,null,null,null,"2013-12-08","13/14","12/13","11/12",null,"2013-12-08","13/14","12/13","11/12"]
[null,null,null,null,null,null,null,"2013-12-09","13/14","12/13","11/12",null,"2013-12-09","13/14","12/13","11/12"]
[null,null,null,null,null,null,null,"2013-12-10","13/14","12/13","11/12",null,"2013-12-10","13/14","12/13","11/12"]
[null,null,null,null,null,null,null,"2013-12-11","13/14","12/13","11/12",null,"2013-12-11","13/14","12/13","11/12"]
[null,null,null,null,null,null,null,"2013-12-12","13/14","12/13","11/12",null,"2013-12-12","13/14","12/13","11/12"]
[null,null,null,null,null,null,null,"2013-12-13","13/14","12/13","11/12",null,"2013-12-13","13/14","12/13","11/12"]
[null,null,null,null,null,null,null,"2013-12-14","13/14","12/13","11/12",null,"2013-12-14","13/14","12/13","11/12"]
[null,null,null,null,null,null,null,"2013-12-15","13/14","12/13","11/12",null,"2013-12-15","13/14","12/13","11/12"]
[null,null,null,null,null,null,null,"2013-12-16","13/14","12/13","11/12",null,"2013-12-16","13/14","12/13","11/12"]
[null,null,null,null,null,null,null,"2013-12-17","13/14","12/13","11/12",null,"2013-12-17","13/14","12/13","11/12"]
[null,null,null,null,null,null,null,"2013-12-18","13/14","12/13","11/12",null,"2013-12-18","13/14","12/13","11/12"]
[null,null,null,null,null,null,null,"2013-12-19","13/14","12/13","11/12",null,"2013-12-19","13/14","12/13","11/12"]
[null,null,null,null,null,null,null,"2013-12-20","13/14","12/13","11/12",null,"2013-12-20","13/14","12/13","11/12"]
[null,null,null,null,null,null,null,"2013-12-21","13/14","12/13","11/12",null,"2013-12-21","13/14","12/13","11/12"]
[null,null,null,null,null,null,null,"2013-12-22","13/14","12/13","11/12",null,"2013-12-22","13/14","12/13","11/12"]
[null,null,null,null,null,null,null,"2013-12-23","13/14","12/13","11/12",null,"2013-12-23","13/14","12/13","11/12"]
[null,null,null,null,null,null,null,"2013-12-24","13/14","12/13","11/12",null,"2013-12-24","13/14","12/13","11/12"]
[null,null,null,null,null,null,null,"2013-12-25","13/14","12/13","11/12",null,"2013-12-25","13/14","12/13","11/12"]
[null,null,null,null,null,null,null,"2013-12-26","13/14","12/13","11/12",null,"2013-12-26","13/14","12/13","11/12"]
[null,null,null,null,null,null,null,"2013-12-27","13/14","12/13","11/12",null,"2013-12-27","13/14","12/13","11/12"]
[null,null,null,null,null,null,null,"2013-12-28","13/14","12/13","11/12",null,"2013-12-28","13/14","12/13","11/12"]
[null,null,null,null,null,null,null,"2013-12-29","13/14","12/13","11/12",null,"2013-12-29","13/14","12/13","11/12"]
[null,null,null,null,null,null,null,"2013-12-30","13/14","12/13","11/12",null,"2013-12-30","13/14","12/13","11/12"]
[null,null,null,null,null,null,null,"2013-12-31","13/14","12/13","11/12",null,"2013-12-31","13/14","12/13","11/12"]
[null,null,null,null,null,null,null,"2014-01-01","13/14","12/13","11/12",null,"2014-01-01","13/14","12/13","11/12"]
[null,null,null,null,null,null,null,"2014-01-02","13/14","12/13","11/12",null,"2014-01-02","13/14","12/13","11/12"]
[null,null,null,null,null,null,null,"2014-01-03","13/14","12/13","11/12",null,"2014-01-03","13/14","12/13","11/12"]
[null,null,null,null,null,null,null,"2014-01-04","13/14","12/13","11/12",null,"2014-01-04","13/14","12/13","11/12"]
[null,null,null,null,null,null,null,"2014-01-05","13/14","12/13","11/12",null,"2014-01-05","13/14","12/13","11/12"]
[null,null,null,null,null,null,null,"2014-01-06","13/14","12/13","11/12",null,"2014-01-06","13/14","12/13","11/12"]
[null,null,null,null,null,null,null,"2014-01-07","13/14","12/13","11/12",null,"2014-01-07","13/14","12/13","11/12"]
[null,null,null,null,null,null,null,"2014-01-08","13/14","12/13","11/12",null,"2014-01-08","13/14","12/13","11/12"]
[null,null,null,null,null,null,null,"2014-01-09","13/14","12/13","11/12",null,"2014-01-09","13/14","12/13","11/12"]
[null,null,null,null,null,null,null,"2014-01-10","13/14","12/13","11/12",null,"2014-01-10","13/14","12/13","11/12"]
[null,null,null,null,null,null,null,"2014-01-11","13/14","12/13","11/12",null,"2014-01-11","13/14","12/13","11/12"]
[null,null,null,null,null,null,null,"2014-01-12","13/14","12/13","11/12",null,"2014-01-12","13/14","12/13","11/12"]
[null,null,null,null,null,null,null,"2014-01-13","13/14","12/13","11/12",null,"2014-01-13","13/14","12/13","11/12"]
[null,null,null,null,null,null,null,"2014-01-14","13/14","12/13","11/12",null,"2014-01-14","13/14","12/13","11/12"]
[null,null,null,null,null,null,null,"2014-01-15","13/14","12/13","11/12",null,"2014-01-15","13/14","12/13","11/12"]
[null,null,null,null,null,null,null,"2014-01-16","13/14","12/13","11/12",null,"2014-01-16","13/14","12/13","11/12"]
[null,null,null,null,null,null,null,"2014-01-17","13/14","12/13","11/12",null,"2014-01-17","13/14","12/13","11/12"]
[null,null,null,null,null,null,null,"2014-01-18","13/14","12/13","11/12",null,"2014-01-18","13/14","12/13","11/12"]
[null,null,null,null,null,null,null,"2014-01-19","13/14","12/13","11/12",null,"2014-01-19","13/14","12/13","11/12"]
[null,null,null,null,null,null,null,"2014-01-20","13/14","12/13","11/12",null,"2014-01-20","13/14","12/13","11/12"]
[null,null,null,null,null,null,null,"2014-01-21","13/14","12/13","11/12",null,"2014-01-21","13/14","12/13","11/12"]
[null,null,null,null,null,null,null,"2014-01-22","13/14","12/13","11/12",null,"2014-01-22","13/14","12/13","11/12"]
[null,null,null,null,null,null,null,"2014-01-23","13/14","12/13","11/12",null,"2014-01-23","13/14","12/13","11/12"]
[null,null,null,null,null,null,null,"2014-01-24","13/14","12/13","11/12",null,"2014-01-24","13/14","12/13","11/12"]
[null,null,null,null,null,null,null,"2014-01-25","13/14","12/13","11/12",null,"2014-01-25","13/14","12/13","11/12"]
[null,null,null,null,null,null,null,"2014-01-26","13/14","12/13","11/12",null,"2014-01-26","13/14","12/13","11/12"]
[null,null,null,null,null,null,null,"2014-01-27","13/14","12/13","11/12",null,"2014-01-27","13/14","12/13","11/12"]
[null,null,null,null,null,null,null,"2014-01-28","13/14","12/13","11/12",null,"2014-01-28","13/14","12/13","11/12"]
[null,null,null,null,null,null,null,"2014-01-29","13/14","12/13","11/12",null,"2014-01-29","13/14","12/13","11/12"]
[null,null,null,null,null,null,null,"2014-01-30","13/14","12/13","11/12",null,"2014-01-30","13/14","12/13","11/12"]
[null,null,null,null,null,null,null,"2014-01-31","13/14","12/13","11/12",null,"2014-01-31","13/14","12/13","11/12"]
[null,null,null,null,null,null,null,"2014-02-01","13/14","12/13","11/12",null,"2014-02-01","13/14","12/13","11/12"]
[null,null,null,null,null,null,null,"2014-02-02","13/14","12/13","11/12",null,"2014-02-02","13/14","12/13","11/12"]
[null,null,null,null,null,null,null,"2014-02-03","13/14","12/13","11/12",null,"2014-02-03","13/14","12/13","11/12"]
[null,null,null,null,null,null,null,"2014-02-04","13/14","12/13","11/12",null,"2014-02-04","13/14","12/13","11/12"]
[null,null,null,null,null,null,null,"2014-02-05","13/14","12/13","11/12",null,"2014-02-05","13/14","12/13","11/12"]
[null,null,null,null,null,null,null,"2014-02-06","13/14","12/13","11/12",null,"2014-02-06","13/14","12/13","11/12"]
[null,null,null,null,null,null,null,"2014-02-07","13/14","12/13","11/12",null,"2014-02-07","13/14","12/13","11/12"]
[null,null,null,null,null,null,null,"2014-02-08","13/14","12/13","11/12",null,"2014-02-08","13/14","12/13","11/12"]
[null,null,null,null,null,null,null,"2014-02-09","13/14","12/13","11/12",null,"2014-02-09","13/14","12/13","11/12"]
[null,null,null,null,null,null,null,"2014-02-10","13/14","12/13","11/12",null,"2014-02-10","13/14","12/13","11/12"]
[null,null,null,null,null,null,null,"2014-02-11","13/14","12/13","11/12",null,"2014-02-11","13/14","12/13","11/12"]
[null,null,null,null,null,null,null,"2014-02-12","13/14","12/13","11/12",null,"2014-02-12","13/14","12/13","11/12"]
[null,null,null,null,null,null,null,"2014-02-13","13/14","12/13","11/12",null,"2014-02-13","13/14","12/13","11/12"]
[null,null,null,null,null,null,null,"2014-02-14","13/14","12/13","11/12",null,"2014-02-14","13/14","12/13","11/12"]
[null,null,null,null,null,null,null,"2014-02-15","13/14","12/13","11/12",null,"2014-02-15","13/14","12/13","11/12"]
[null,null,null,null,null,null,null,"2014-02-16","13/14","12/13","11/12",null,"2014-02-16","13/14","12/13","11/12"]
[null,null,null,null,null,null,null,"2014-02-17","13/14","12/13","11/12",null,"2014-02-17","13/14","12/13","11/12"]
[null,null,null,null,null,null,null,"2014-02-18","13/14","12/13","11/12",null,"2014-02-18","13/14","12/13","11/12"]
[null,null,null,null,null,null,null,"2014-02-19","13/14","12/13","11/12",null,"2014-02-19","13/14","12/13","11/12"]
[null,null,null,null,null,null,null,"2014-02-20","13/14","12/13","11/12",null,"2014-02-20","13/14","12/13","11/12"]
[null,null,null,null,null,null,null,"2014-02-21","13/14","12/13","11/12",null,"2014-02-21","13/14","12/13","11/12"]
[null,null,null,null,null,null,null,"2014-02-22","13/14","12/13","11/12",null,"2014-02-22","13/14","12/13","11/12"]
[null,null,null,null,null,null,null,"2014-02-23","13/14","12/13","11/12",null,"2014-02-23","13/14","12/13","11/12"]
[null,null,null,null,null,null,null,"2014-02-24","13/14","12/13","11/12",null,"2014-02-24","13/14","12/13","11/12"]
[null,null,null,null,null,null,null,"2014-02-25","13/14","12/13","11/12",null,"2014-02-25","13/14","12/13","11/12"]
[null,null,null,null,null,null,null,"2014-02-26","13/14","12/13","11/12",null,"2014-02-26","13/14","12/13","11/12"]
[null,null,null,null,null,null,null,"2014-02-27","13/14","12/13","11/12",null,"2014-02-27","13/14","12/13","11/12"]
[null,null,null,null,null,null,null,"2014-02-28","13/14","12/13","11/12",null,"2014-02-28","13/14","12/13","11/12"]
[null,null,null,null,null,null,null,"2014-03-01","13/14","12/13","11/12",null,"2014-03-01","13/14","12/13","11/12"]
[null,null,null,null,null,null,null,"2014-03-02","13/14","12/13","11/12",null,"2014-03-02","13/14","12/13","11/12"]
[null,null,null,null,null,null,null,"2014-03-03","13/14","12/13","11/12",null,"2014-03-03","13/14","12/13","11/12"]
[null,null,null,null,null,null,null,"2014-03-04","13/14","12/13","11/12",null,"2014-03-04","13/14","12/13","11/12"]
[null,null,null,null,null,null,null,"2014-03-05","13/14","12/13","11/12",null,"2014-03-05","13/14","12/13","11/12"]
[null,null,null,null,null,null,null,"2014-03-06","13/14","12/13","11/12",null,"2014-03-06","13/14","12/13","11/12"]
[null,null,null,null,null,null,null,"2014-03-07","13/14","12/13","11/12",null,"2014-03-07","13/14","12/13","11/12"]
[null,null,null,null,null,null,null,"2014-03-08","13/14","12/13","11/12",null,"2014-03-08","13/14","12/13","11/12"]
[null,null,null,null,null,null,null,"2014-03-09","13/14","12/13","11/12",null,"2014-03-09","13/14","12/13","11/12"]
[null,null,null,null,null,null,null,"2014-03-10","13/14","12/13","11/12",null,"2014-03-10","13/14","12/13","11/12"]
[null,null,null,null,null,null,null,"2014-03-11","13/14","12/13","11/12",null,"2014-03-11","13/14","12/13","11/12"]
[null,null,null,null,null,null,null,"2014-03-12","13/14","12/13","11/12",null,"2014-03-12","13/14","12/13","11/12"]
[null,null,null,null,null,null,null,"2014-03-13","13/14","12/13","11/12",null,"2014-03-13","13/14","12/13","11/12"]
[null,null,null,null,null,null,null,"2014-03-14","13/14","12/13","11/12",null,"2014-03-14","13/14","12/13","11/12"]
[null,null,null,null,null,null,null,"2014-03-15","13/14","12/13","11/12",null,"2014-03-15","13/14","12/13","11/12"]
[null,null,null,null,null,null,null,"2014-03-16","13/14","12/13","11/12",null,"2014-03-16","13/14","12/13","11/12"]
[null,null,null,null,null,null,null,"2014-03-17","13/14","12/13","11/12",null,"2014-03-17","13/14","12/13","11/12"]
[null,null,null,null,null,null,null,"2014-03-18","13/14","12/13","11/12",null,"2014-03-18","13/14","12/13","11/12"]
[null,null,null,null,null,null,null,"2014-03-19","13/14","12/13","11/12",null,"2014-03-19","13/14","12/13","11/12"]
[null,null,null,null,null,null,null,"2014-03-20","13/14","12/13","11/12",null,"2014-03-20","13/14","12/13","11/12"]
[null,null,null,null,null,null,null,"2014-03-21","13/14","12/13","11/12",null,"2014-03-21","13/14","12/13","11/12"]
[null,null,null,null,null,null,null,"2014-03-22","13/14","12/13","11/12",null,"2014-03-22","13/14","12/13","11/12"]
[null,null,null,null,null,null,null,"2014-03-23","13/14","12/13","11/12",null,"2014-03-23","13/14","12/13","11/12"]
[null,null,null,null,null,null,null,"2014-03-24","13/14","12/13","11/12",null,"2014-03-24","13/14","12/13","11/12"]
[null,null,null,null,null,null,null,"2014-03-25","13/14","12/13","11/12",null,"2014-03-25","13/14","12/13","11/12"]
[null,null,null,null,null,null,null,"2014-03-26","13/14","12/13","11/12",null,"2014-03-26","13/14","12/13","11/12"]
[null,null,null,null,null,null,null,"2014-03-27","13/14","12/13","11/12",null,"2014-03-27","13/14","12/13","11/12"]
[null,null,null,null,null,null,null,"2014-03-28","13/14","12/13","11/12",null,"2014-03-28","13/14","12/13","11/12"]
[null,null,null,null,null,null,null,"2014-03-29","13/14","12/13","11/12",null,"2014-03-29","13/14","12/13","11/12"]
[null,null,null,null,null,null,null,"2014-03-30","13/14","12/13","11/12",null,"2014-03-30","13/14","12/13","11/12"]
[null,null,null,null,null,null,null,"2014-03-31","13/14","12/13","11/12",null,"2014-03-31","13/14","12/13","11/12"]
[null,null,null,null,null,null,null,"2014-04-01","13/14","12/13","11/12",null,"2014-04-01","13/14","12/13","11/12"]
[null,null,null,null,null,null,null,"2014-04-02","13/14","12/13","11/12",null,"2014-04-02","13/14","12/13","11/12"]
[null,null,null,null,null,null,null,"2014-04-03","13/14","12/13","11/12",null,"2014-04-03","13/14","12/13","11/12"]
[null,null,null,null,null,null,null,"2014-04-04","13/14","12/13","11/12",null,"2014-04-04","13/14","12/13","11/12"]
[null,null,null,null,null,null,null,"2014-04-05","13/14","12/13","11/12",null,"2014-04-05","13/14","12/13","11/12"]
[null,null,null,null,null,null,null,"2014-04-06","14/15","13/14","12/13",null,"2014-04-06","14/15","13/14","12/13"]
[null,null,null,null,null,null,null,"2014-04-07","14/15","13/14","12/13",null,"2014-04-07","14/15","13/14","12/13"]
[null,null,null,null,null,null,null,"2014-04-08","14/15","13/14","12/13",null,"2014-04-08","14/15","13/14","12/13"]
[null,null,null,null,null,null,null,"2014-04-09","14/15","13/14","12/13",null,"2014-04-09","14/15","13/14","12/13"]
[null,null,null,null,null,null,null,"2014-04-10","14/15","13/14","12/13",null,"2014-04-10","14/15","13/14","12/13"]
[null,null,null,null,null,null,null,"2014-04-11","14/15","13/14","12/13",null,"2014-04-11","14/15","13/14","12/13"]
[null,null,null,null,null,null,null,"2014-04-12","14/15","13/14","12/13",null,"2014-04-12","14/15","13/14","12/13"]
[null,null,null,null,null,null,null,"2014-04-13","14/15","13/14","12/13",null,"2014-04-13","14/15","13/14","12/13"]
[null,null,null,null,null,null,null,"2014-04-14","14/15","13/14","12/13",null,"2014-04-14","14/15","13/14","12/13"]
[null,null,null,null,null,null,null,"2014-04-15","14/15","13/14","12/13",null,"2014-04-15","14/15","13/14","12/13"]
[null,null,null,null,null,null,null,"2014-04-16","14/15","13/14","12/13",null,"2014-04-16","14/15","13/14","12/13"]
[null,null,null,null,null,null,null,"2014-04-17","14/15","13/14","12/13",null,"2014-04-17","14/15","13/14","12/13"]
[null,null,null,null,null,null,null,"2014-04-18","14/15","13/14","12/13",null,"2014-04-18","14/15","13/14","12/13"]
[null,null,null,null,null,null,null,"2014-04-19","14/15","13/14","12/13",null,"2014-04-19","14/15","13/14","12/13"]
[null,null,null,null,null,null,null,"2014-04-20","14/15","13/14","12/13",null,"2014-04-20","14/15","13/14","12/13"]
[null,null,null,null,null,null,null,"2014-04-21","14/15","13/14","12/13",null,"2014-04-21","14/15","13/14","12/13"]
[null,null,null,null,null,null,null,"2014-04-22","14/15","13/14","12/13",null,"2014-04-22","14/15","13/14","12/13"]
[null,null,null,null,null,null,null,"2014-04-23","14/15","13/14","12/13",null,"2014-04-23","14/15","13/14","12/13"]
[null,null,null,null,null,null,null,"2014-04-24","14/15","13/14","12/13",null,"2014-04-24","14/15","13/14","12/13"]
[null,null,null,null,null,null,null,"2014-04-25","14/15","13/14","12/13",null,"2014-04-25","14/15","13/14","12/13"]
[null,null,null,null,null,null,null,"2014-04-26","14/15","13/14","12/13",null,"2014-04-26","14/15","13/14","12/13"]
[null,null,null,null,null,null,null,"2014-04-27","14/15","13/14","12/13",null,"2014-04-27","14/15","13/14","12/13"]
[null,null,null,null,null,null,null,"2014-04-28","14/15","13/14","12/13",null,"2014-04-28","14/15","13/14","12/13"]
[null,null,null,null,null,null,null,"2014-04-29","14/15","13/14","12/13",null,"2014-04-29","14/15","13/14","12/13"]
[null,null,null,null,null,null,null,"2014-04-30","14/15","13/14","12/13",null,"2014-04-30","14/15","13/14","12/13"]
[null,null,null,null,null,null,null,"2014-05-01","14/15","13/14","12/13",null,"2014-05-01","14/15","13/14","12/13"]
[null,null,null,null,null,null,null,"2014-05-02","14/15","13/14","12/13",null,"2014-05-02","14/15","13/14","12/13"]
[null,null,null,null,null,null,null,"2014-05-03","14/15","13/14","12/13",null,"2014-05-03","14/15","13/14","12/13"]
[null,null,null,null,null,null,null,"2014-05-04","14/15","13/14","12/13",null,"2014-05-04","14/15","13/14","12/13"]
[null,null,null,null,null,null,null,"2014-05-05","14/15","13/14","12/13",null,"2014-05-05","14/15","13/14","12/13"]
[null,null,null,null,null,null,null,"2014-05-06","14/15","13/14","12/13",null,"2014-05-06","14/15","13/14","12/13"]
[null,null,null,null,null,null,null,"2014-05-07","14/15","13/14","12/13",null,"2014-05-07","14/15","13/14","12/13"]
[null,null,null,null,null,null,null,"2014-05-08","14/15","13/14","12/13",null,"2014-05-08","14/15","13/14","12/13"]
[null,null,null,null,null,null,null,"2014-05-09","14/15","13/14","12/13",null,"2014-05-09","14/15","13/14","12/13"]
[null,null,null,null,null,null,null,"2014-05-10","14/15","13/14","12/13",null,"2014-05-10","14/15","13/14","12/13"]
[null,null,null,null,null,null,null,"2014-05-11","14/15","13/14","12/13",null,"2014-05-11","14/15","13/14","12/13"]
[null,null,null,null,null,null,null,"2014-05-12","14/15","13/14","12/13",null,"2014-05-12","14/15","13/14","12/13"]
[null,null,null,null,null,null,null,"2014-05-13","14/15","13/14","12/13",null,"2014-05-13","14/15","13/14","12/13"]
[null,null,null,null,null,null,null,"2014-05-14","14/15","13/14","12/13",null,"2014-05-14","14/15","13/14","12/13"]
[null,null,null,null,null,null,null,"2014-05-15","14/15","13/14","12/13",null,"2014-05-15","14/15","13/14","12/13"]
[null,null,null,null,null,null,null,"2014-05-16","14/15","13/14","12/13",null,"2014-05-16","14/15","13/14","12/13"]
[null,null,null,null,null,null,null,"2014-05-17","14/15","13/14","12/13",null,"2014-05-17","14/15","13/14","12/13"]
[null,null,null,null,null,null,null,"2014-05-18","14/15","13/14","12/13",null,"2014-05-18","14/15","13/14","12/13"]
[null,null,null,null,null,null,null,"2014-05-19","14/15","13/14","12/13",null,"2014-05-19","14/15","13/14","12/13"]
[null,null,null,null,null,null,null,"2014-05-20","14/15","13/14","12/13",null,"2014-05-20","14/15","13/14","12/13"]
[null,null,null,null,null,null,null,"2014-05-21","14/15","13/14","12/13",null,"2014-05-21","14/15","13/14","12/13"]
[null,null,null,null,null,null,null,"2014-05-22","14/15","13/14","12/13",null,"2014-05-22","14/15","13/14","12/13"]
[null,null,null,null,null,null,null,"2014-05-23","14/15","13/14","12/13",null,"2014-05-23","14/15","13/14","12/13"]
[null,null,null,null,null,null,null,"2014-05-24","14/15","13/14","12/13",null,"2014-05-24","14/15","13/14","12/13"]
[null,null,null,null,null,null,null,"2014-05-25","14/15","13/14","12/13",null,"2014-05-25","14/15","13/14","12/13"]
[null,null,null,null,null,null,null,"2014-05-26","14/15","13/14","12/13",null,"2014-05-26","14/15","13/14","12/13"]
[null,null,null,null,null,null,null,"2014-05-27","14/15","13/14","12/13",null,"2014-05-27","14/15","13/14","12/13"]
[null,null,null,null,null,null,null,"2014-05-28","14/15","13/14","12/13",null,"2014-05-28","14/15","13/14","12/13"]
[null,null,null,null,null,null,null,"2014-05-29","14/15","13/14","12/13",null,"2014-05-29","14/15","13/14","12/13"]
[null,null,null,null,null,null,null,"2014-05-30","14/15","13/14","12/13",null,"2014-05-30","14/15","13/14","12/13"]
[null,null,null,null,null,null,null,"2014-05-31","14/15","13/14","12/13",null,"2014-05-31","14/15","13/14","12/13"]
[null,null,null,null,null,null,null,"2014-06-01","14/15","13/14","12/13",null,"2014-06-01","14/15","13/14","12/13"]
[null,null,null,null,null,null,null,"2014-06-02","14/15","13/14","12/13",null,"2014-06-02","14/15","13/14","12/13"]
[null,null,null,null,null,null,null,"2014-06-03","14/15","13/14","12/13",null,"2014-06-03","14/15","13/14","12/13"]
[null,null,null,null,null,null,null,"2014-06-04","14/15","13/14","12/13",null,"2014-06-04","14/15","13/14","12/13"]
[null,null,null,null,null,null,null,"2014-06-05","14/15","13/14","12/13",null,"2014-06-05","14/15","13/14","12/13"]
[null,null,null,null,null,null,null,"2014-06-06","14/15","13/14","12/13",null,"2014-06-06","14/15","13/14","12/13"]
[null,null,null,null,null,null,null,"2014-06-07","14/15","13/14","12/13",null,"2014-06-07","14/15","13/14","12/13"]
[null,null,null,null,null,null,null,"2014-06-08","14/15","13/14","12/13",null,"2014-06-08","14/15","13/14","12/13"]
[null,null,null,null,null,null,null,"2014-06-09","14/15","13/14","12/13",null,"2014-06-09","14/15","13/14","12/13"]
[null,null,null,null,null,null,null,"2014-06-10","14/15","13/14","12/13",null,"2014-06-10","14/15","13/14","12/13"]
[null,null,null,null,null,null,null,"2014-06-11","14/15","13/14","12/13",null,"2014-06-11","14/15","13/14","12/13"]
[null,null,null,null,null,null,null,"2014-06-12","14/15","13/14","12/13",null,"2014-06-12","14/15","13/14","12/13"]
[null,null,null,null,null,null,null,"2014-06-13","14/15","13/14","12/13",null,"2014-06-13","14/15","13/14","12/13"]
[null,null,null,null,null,null,null,"2014-06-14","14/15","13/14","12/13",null,"2014-06-14","14/15","13/14","12/13"]
[null,null,null,null,null,null,null,"2014-06-15","14/15","13/14","12/13",null,"2014-06-15","14/15","13/14","12/13"]
[null,null,null,null,null,null,null,"2014-06-16","14/15","13/14","12/13",null,"2014-06-16","14/15","13/14","12/13"]
[null,null,null,null,null,null,null,"2014-06-17","14/15","13/14","12/13",null,"2014-06-17","14/15","13/14","12/13"]
[null,null,null,null,null,null,null,"2014-06-18","14/15","13/14","12/13",null,"2014-06-18","14/15","13/14","12/13"]
[null,null,null,null,null,null,null,"2014-06-19","14/15","13/14","12/13",null,"2014-06-19","14/15","13/14","12/13"]
[null,null,null,null,null,null,null,"2014-06-20","14/15","13/14","12/13",null,"2014-06-20","14/15","13/14","12/13"]
[null,null,null,null,null,null,null,"2014-06-21","14/15","13/14","12/13",null,"2014-06-21","14/15","13/14","12/13"]
[null,null,null,null,null,null,null,"2014-06-22","14/15","13/14","12/13",null,"2014-06-22","14/15","13/14","12/13"]
[null,null,null,null,null,null,null,"2014-06-23","14/15","13/14","12/13",null,"2014-06-23","14/15","13/14","12/13"]
[null,null,null,null,null,null,null,"2014-06-24","14/15","13/14","12/13",null,"2014-06-24","14/15","13/14","12/13"]
[null,null,null,null,null,null,null,"2014-06-25","14/15","13/14","12/13",null,"2014-06-25","14/15","13/14","12/13"]
[null,null,null,null,null,null,null,"2014-06-26","14/15","13/14","12/13",null,"2014-06-26","14/15","13/14","12/13"]
[null,null,null,null,null,null,null,"2014-06-27","14/15","13/14","12/13",null,"2014-06-27","14/15","13/14","12/13"]
[null,null,null,null,null,null,null,"2014-06-28","14/15","13/14","12/13",null,"2014-06-28","14/15","13/14","12/13"]
[null,null,null,null,null,null,null,"2014-06-29","14/15","13/14","12/13",null,"2014-06-29","14/15","13/14","12/13"]
[null,null,null,null,null,null,null,"2014-06-30","14/15","13/14","12/13",null,"2014-06-30","14/15","13/14","12/13"]
[null,null,null,null,null,null,null,"2014-07-01","14/15","13/14","12/13",null,"2014-07-01","14/15","13/14","12/13"]
[null,null,null,null,null,null,null,"2014-07-02","14/15","13/14","12/13",null,"2014-07-02","14/15","13/14","12/13"]
[null,null,null,null,null,null,null,"2014-07-03","14/15","13/14","12/13",null,"2014-07-03","14/15","13/14","12/13"]
[null,null,null,null,null,null,null,"2014-07-04","14/15","13/14","12/13",null,"2014-07-04","14/15","13/14","12/13"]
[null,null,null,null,null,null,null,"2014-07-05","14/15","13/14","12/13",null,"2014-07-05","14/15","13/14","12/13"]
[null,null,null,null,null,null,null,"2014-07-06","14/15","13/14","12/13",null,"2014-07-06","14/15","13/14","12/13"]
[null,null,null,null,null,null,null,"2014-07-07","14/15","13/14","12/13",null,"2014-07-07","14/15","13/14","12/13"]
[null,null,null,null,null,null,null,"2014-07-08","14/15","13/14","12/13",null,"2014-07-08","14/15","13/14","12/13"]
[null,null,null,null,null,null,null,"2014-07-09","14/15","13/14","12/13",null,"2014-07-09","14/15","13/14","12/13"]
[null,null,null,null,null,null,null,"2014-07-10","14/15","13/14","12/13",null,"2014-07-10","14/15","13/14","12/13"]
[null,null,null,null,null,null,null,"2014-07-11","14/15","13/14","12/13",null,"2014-07-11","14/15","13/14","12/13"]
[null,null,null,null,null,null,null,"2014-07-12","14/15","13/14","12/13",null,"2014-07-12","14/15","13/14","12/13"]
[null,null,null,null,null,null,null,"2014-07-13","14/15","13/14","12/13",null,"2014-07-13","14/15","13/14","12/13"]
[null,null,null,null,null,null,null,"2014-07-14","14/15","13/14","12/13",null,"2014-07-14","14/15","13/14","12/13"]
[null,null,null,null,null,null,null,"2014-07-15","14/15","13/14","12/13",null,"2014-07-15","14/15","13/14","12/13"]
[null,null,null,null,null,null,null,"2014-07-16","14/15","13/14","12/13",null,"2014-07-16","14/15","13/14","12/13"]
[null,null,null,null,null,null,null,"2014-07-17","14/15","13/14","12/13",null,"2014-07-17","14/15","13/14","12/13"]
[null,null,null,null,null,null,null,"2014-07-18","14/15","13/14","12/13",null,"2014-07-18","14/15","13/14","12/13"]
[null,null,null,null,null,null,null,"2014-07-19","14/15","13/14","12/13",null,"2014-07-19","14/15","13/14","12/13"]
[null,null,null,null,null,null,null,"2014-07-20","14/15","13/14","12/13",null,"2014-07-20","14/15","13/14","12/13"]
[null,null,null,null,null,null,null,"2014-07-21","14/15","13/14","12/13",null,"2014-07-21","14/15","13/14","12/13"]
[null,null,null,null,null,null,null,"2014-07-22","14/15","13/14","12/13",null,"2014-07-22","14/15","13/14","12/13"]
[null,null,null,null,null,null,null,"2014-07-23","14/15","13/14","12/13",null,"2014-07-23","14/15","13/14","12/13"]
[null,null,null,null,null,null,null,"2014-07-24","14/15","13/14","12/13",null,"2014-07-24","14/15","13/14","12/13"]
[null,null,null,null,null,null,null,"2014-07-25","14/15","13/14","12/13",null,"2014-07-25","14/15","13/14","12/13"]
[null,null,null,null,null,null,null,"2014-07-26","14/15","13/14","12/13",null,"2014-07-26","14/15","13/14","12/13"]
[null,null,null,null,null,null,null,"2014-07-27","14/15","13/14","12/13",null,"2014-07-27","14/15","13/14","12/13"]
[null,null,null,null,null,null,null,"2014-07-28","14/15","13/14","12/13",null,"2014-07-28","14/15","13/14","12/13"]
[null,null,null,null,null,null,null,"2014-07-29","14/15","13/14","12/13",null,"2014-07-29","14/15","13/14","12/13"]
[null,null,null,null,null,null,null,"2014-07-30","14/15","13/14","12/13",null,"2014-07-30","14/15","13/14","12/13"]
[null,null,null,null,null,null,null,"2014-07-31","14/15","13/14","12/13",null,"2014-07-31","14/15","13/14","12/13"]
[null,null,null,null,null,null,null,"2014-08-01","14/15","13/14","12/13",null,"2014-08-01","14/15","13/14","12/13"]
[null,null,null,null,null,null,null,"2014-08-02","14/15","13/14","12/13",null,"2014-08-02","14/15","13/14","12/13"]
[null,null,null,null,null,null,null,"2014-08-03","14/15","13/14","12/13",null,"2014-08-03","14/15","13/14","12/13"]
[null,null,null,null,null,null,null,"2014-08-04","14/15","13/14","12/13",null,"2014-08-04","14/15","13/14","12/13"]
[null,null,null,null,null,null,null,"2014-08-05","14/15","13/14","12/13",null,"2014-08-05","14/15","13/14","12/13"]
[null,null,null,null,null,null,null,"2014-08-06","14/15","13/14","12/13",null,"2014-08-06","14/15","13/14","12/13"]
[null,null,null,null,null,null,null,"2014-08-07","14/15","13/14","12/13",null,"2014-08-07","14/15","13/14","12/13"]
[null,null,null,null,null,null,null,"2014-08-08","14/15","13/14","12/13",null,"2014-08-08","14/15","13/14","12/13"]
[null,null,null,null,null,null,null,"2014-08-09","14/15","13/14","12/13",null,"2014-08-09","14/15","13/14","12/13"]
[null,null,null,null,null,null,null,"2014-08-10","14/15","13/14","12/13",null,"2014-08-10","14/15","13/14","12/13"]
[null,null,null,null,null,null,null,"2014-08-11","14/15","13/14","12/13",null,"2014-08-11","14/15","13/14","12/13"]
[null,null,null,null,null,null,null,"2014-08-12","14/15","13/14","12/13",null,"2014-08-12","14/15","13/14","12/13"]
[null,null,null,null,null,null,null,"2014-08-13","14/15","13/14","12/13",null,"2014-08-13","14/15","13/14","12/13"]
[null,null,null,null,null,null,null,"2014-08-14","14/15","13/14","12/13",null,"2014-08-14","14/15","13/14","12/13"]
[null,null,null,null,null,null,null,"2014-08-15","14/15","13/14","12/13",null,"2014-08-15","14/15","13/14","12/13"]
[null,null,null,null,null,null,null,"2014-08-16","14/15","13/14","12/13",null,"2014-08-16","14/15","13/14","12/13"]
[null,null,null,null,null,null,null,"2014-08-17","14/15","13/14","12/13",null,"2014-08-17","14/15","13/14","12/13"]
[null,null,null,null,null,null,null,"2014-08-18","14/15","13/14","12/13",null,"2014-08-18","14/15","13/14","12/13"]
[null,null,null,null,null,null,null,"2014-08-19","14/15","13/14","12/13",null,"2014-08-19","14/15","13/14","12/13"]
[null,null,null,null,null,null,null,"2014-08-20","14/15","13/14","12/13",null,"2014-08-20","14/15","13/14","12/13"]
[null,null,null,null,null,null,null,"2014-08-21","14/15","13/14","12/13",null,"2014-08-21","14/15","13/14","12/13"]
[null,null,null,null,null,null,null,"2014-08-22","14/15","13/14","12/13",null,"2014-08-22","14/15","13/14","12/13"]
[null,null,null,null,null,null,null,"2014-08-23","14/15","13/14","12/13",null,"2014-08-23","14/15","13/14","12/13"]
[null,null,null,null,null,null,null,"2014-08-24","14/15","13/14","12/13",null,"2014-08-24","14/15","13/14","12/13"]
[null,null,null,null,null,null,null,"2014-08-25","14/15","13/14","12/13",null,"2014-08-25","14/15","13/14","12/13"]
[null,null,null,null,null,null,null,"2014-08-26","14/15","13/14","12/13",null,"2014-08-26","14/15","13/14","12/13"]
[null,null,null,null,null,null,null,"2014-08-27","14/15","13/14","12/13",null,"2014-08-27","14/15","13/14","12/13"]
[null,null,null,null,null,null,null,"2014-08-28","14/15","13/14","12/13",null,"2014-08-28","14/15","13/14","12/13"]
[null,null,null,null,null,null,null,"2014-08-29","14/15","13/14","12/13",null,"2014-08-29","14/15","13/14","12/13"]
[null,null,null,null,null,null,null,"2014-08-30","14/15","13/14","12/13",null,"2014-08-30","14/15","13/14","12/13"]
[null,null,null,null,null,null,null,"2014-08-31","14/15","13/14","12/13",null,"2014-08-31","14/15","13/14","12/13"]
[null,null,null,null,null,null,null,"2014-09-01","14/15","13/14","12/13",null,"2014-09-01","14/15","13/14","12/13"]
[null,null,null,null,null,null,null,"2014-09-02","14/15","13/14","12/13",null,"2014-09-02","14/15","13/14","12/13"]
[null,null,null,null,null,null,null,"2014-09-03","14/15","13/14","12/13",null,"2014-09-03","14/15","13/14","12/13"]
[null,null,null,null,null,null,null,"2014-09-04","14/15","13/14","12/13",null,"2014-09-04","14/15","13/14","12/13"]
[null,null,null,null,null,null,null,"2014-09-05","14/15","13/14","12/13",null,"2014-09-05","14/15","13/14","12/13"]
[null,null,null,null,null,null,null,"2014-09-06","14/15","13/14","12/13",null,"2014-09-06","14/15","13/14","12/13"]
[null,null,null,null,null,null,null,"2014-09-07","14/15","13/14","12/13",null,"2014-09-07","14/15","13/14","12/13"]
[null,null,null,null,null,null,null,"2014-09-08","14/15","13/14","12/13",null,"2014-09-08","14/15","13/14","12/13"]
[null,null,null,null,null,null,null,"2014-09-09","14/15","13/14","12/13",null,"2014-09-09","14/15","13/14","12/13"]
[null,null,null,null,null,null,null,"2014-09-10","14/15","13/14","12/13",null,"2014-09-10","14/15","13/14","12/13"]
[null,null,null,null,null,null,null,"2014-09-11","14/15","13/14","12/13",null,"2014-09-11","14/15","13/14","12/13"]
[null,null,null,null,null,null,null,"2014-09-12","14/15","13/14","12/13",null,"2014-09-12","14/15","13/14","12/13"]
[null,null,null,null,null,null,null,"2014-09-13","14/15","13/14","12/13",null,"2014-09-13","14/15","13/14","12/13"]
[null,null,null,null,null,null,null,"2014-09-14","14/15","13/14","12/13",null,"2014-09-14","14/15","13/14","12/13"]
[null,null,null,null,null,null,null,"2014-09-15","14/15","13/14","12/13",null,"2014-09-15","14/15","13/14","12/13"]
[null,null,null,null,null,null,null,"2014-09-16","14/15","13/14","12/13",null,"2014-09-16","14/15","13/14","12/13"]
[null,null,null,null,null,null,null,"2014-09-17","14/15","13/14","12/13",null,"2014-09-17","14/15","13/14","12/13"]
[null,null,null,null,null,null,null,"2014-09-18","14/15","13/14","12/13",null,"2014-09-18","14/15","13/14","12/13"]
[null,null,null,null,null,null,null,"2014-09-19","14/15","13/14","12/13",null,"2014-09-19","14/15","13/14","12/13"]
[null,null,null,null,null,null,null,"2014-09-20","14/15","13/14","12/13",null,"2014-09-20","14/15","13/14","12/13"]
[null,null,null,null,null,null,null,"2014-09-21","14/15","13/14","12/13",null,"2014-09-21","14/15","13/14","12/13"]
[null,null,null,null,null,null,null,"2014-09-22","14/15","13/14","12/13",null,"2014-09-22","14/15","13/14","12/13"]
[null,null,null,null,null,null,null,"2014-09-23","14/15","13/14","12/13",null,"2014-09-23","14/15","13/14","12/13"]
[null,null,null,null,null,null,null,"2014-09-24","14/15","13/14","12/13",null,"2014-09-24","14/15","13/14","12/13"]
[null,null,null,null,null,null,null,"2014-09-25","14/15","13/14","12/13",null,"2014-09-25","14/15","13/14","12/13"]
[null,null,null,null,null,null,null,"2014-09-26","14/15","13/14","12/13",null,"2014-09-26","14/15","13/14","12/13"]
[null,null,null,null,null,null,null,"2014-09-27","14/15","13/14","12/13",null,"2014-09-27","14/15","13/14","12/13"]
[null,null,null,null,null,null,null,"2014-09-28","14/15","13/14","12/13",null,"2014-09-28","14/15","13/14","12/13"]
[null,null,null,null,null,null,null,"2014-09-29","14/15","13/14","12/13",null,"2014-09-29","14/15","13/14","12/13"]
[null,null,null,null,null,null,null,"2014-09-30","14/15","13/14","12/13",null,"2014-09-30","14/15","13/14","12/13"]
[null,null,null,null,null,null,null,"2014-10-01","14/15","13/14","12/13",null,"2014-10-01","14/15","13/14","12/13"]
[null,null,null,null,null,null,null,"2014-10-02","14/15","13/14","12/13",null,"2014-10-02","14/15","13/14","12/13"]
[null,null,null,null,null,null,null,"2014-10-03","14/15","13/14","12/13",null,"2014-10-03","14/15","13/14","12/13"]
[null,null,null,null,null,null,null,"2014-10-04","14/15","13/14","12/13",null,"2014-10-04","14/15","13/14","12/13"]
[null,null,null,null,null,null,null,"2014-10-05","14/15","13/14","12/13",null,"2014-10-05","14/15","13/14","12/13"]
[null,null,null,null,null,null,null,"2014-10-06","14/15","13/14","12/13",null,"2014-10-06","14/15","13/14","12/13"]
[null,null,null,null,null,null,null,"2014-10-07","14/15","13/14","12/13",null,"2014-10-07","14/15","13/14","12/13"]
[null,null,null,null,null,null,null,"2014-10-08","14/15","13/14","12/13",null,"2014-10-08","14/15","13/14","12/13"]
[null,null,null,null,null,null,null,"2014-10-09","14/15","13/14","12/13",null,"2014-10-09","14/15","13/14","12/13"]
[null,null,null,null,null,null,null,"2014-10-10","14/15","13/14","12/13",null,"2014-10-10","14/15","13/14","12/13"]
[null,null,null,null,null,null,null,"2014-10-11","14/15","13/14","12/13",null,"2014-10-11","14/15","13/14","12/13"]
[null,null,null,null,null,null,null,"2014-10-12","14/15","13/14","12/13",null,"2014-10-12","14/15","13/14","12/13"]
[null,null,null,null,null,null,null,"2014-10-13","14/15","13/14","12/13",null,"2014-10-13","14/15","13/14","12/13"]
[null,null,null,null,null,null,null,"2014-10-14","14/15","13/14","12/13",null,"2014-10-14","14/15","13/14","12/13"]
[null,null,null,null,null,null,null,"2014-10-15","14/15","13/14","12/13",null,"2014-10-15","14/15","13/14","12/13"]
[null,null,null,null,null,null,null,"2014-10-16","14/15","13/14","12/13",null,"2014-10-16","14/15","13/14","12/13"]
[null,null,null,null,null,null,null,"2014-10-17","14/15","13/14","12/13",null,"2014-10-17","14/15","13/14","12/13"]
[null,null,null,null,null,null,null,"2014-10-18","14/15","13/14","12/13",null,"2014-10-18","14/15","13/14","12/13"]
[null,null,null,null,null,null,null,"2014-10-19","14/15","13/14","12/13",null,"2014-10-19","14/15","13/14","12/13"]
[null,null,null,null,null,null,null,"2014-10-20","14/15","13/14","12/13",null,"2014-10-20","14/15","13/14","12/13"]
[null,null,null,null,null,null,null,"2014-10-21","14/15","13/14","12/13",null,"2014-10-21","14/15","13/14","12/13"]
[null,null,null,null,null,null,null,"2014-10-22","14/15","13/14","12/13",null,"2014-10-22","14/15","13/14","12/13"]
[null,null,null,null,null,null,null,"2014-10-23","14/15","13/14","12/13",null,"2014-10-23","14/15","13/14","12/13"]
[null,null,null,null,null,null,null,"2014-10-24","14/15","13/14","12/13",null,"2014-10-24","14/15","13/14","12/13"]
[null,null,null,null,null,null,null,"2014-10-25","14/15","13/14","12/13",null,"2014-10-25","14/15","13/14","12/13"]
[null,null,null,null,null,null,null,"2014-10-26","14/15","13/14","12/13",null,"2014-10-26","14/15","13/14","12/13"]
[null,null,null,null,null,null,null,"2014-10-27","14/15","13/14","12/13",null,"2014-10-27","14/15","13/14","12/13"]
[null,null,null,null,null,null,null,"2014-10-28","14/15","13/14","12/13",null,"2014-10-28","14/15","13/14","12/13"]
[null,null,null,null,null,null,null,"2014-10-29","14/15","13/14","12/13",null,"2014-10-29","14/15","13/14","12/13"]
[null,null,null,null,null,null,null,"2014-10-30","14/15","13/14","12/13",null,"2014-10-30","14/15","13/14","12/13"]
[null,null,null,null,null,null,null,"2014-10-31","14/15","13/14","12/13",null,"2014-10-31","14/15","13/14","12/13"]
[null,null,null,null,null,null,null,"2014-11-01","14/15","13/14","12/13",null,"2014-11-01","14/15","13/14","12/13"]
[null,null,null,null,null,null,null,"2014-11-02","14/15","13/14","12/13",null,"2014-11-02","14/15","13/14","12/13"]
[null,null,null,null,null,null,null,"2014-11-03","14/15","13/14","12/13",null,"2014-11-03","14/15","13/14","12/13"]
[null,null,null,null,null,null,null,"2014-11-04","14/15","13/14","12/13",null,"2014-11-04","14/15","13/14","12/13"]
[null,null,null,null,null,null,null,"2014-11-05","14/15","13/14","12/13",null,"2014-11-05","14/15","13/14","12/13"]
[null,null,null,null,null,null,null,"2014-11-06","14/15","13/14","12/13",null,"2014-11-06","14/15","13/14","12/13"]
[null,null,null,null,null,null,null,"2014-11-07","14/15","13/14","12/13",null,"2014-11-07","14/15","13/14","12/13"]
[null,null,null,null,null,null,null,"2014-11-08","14/15","13/14","12/13",null,"2014-11-08","14/15","13/14","12/13"]
[null,null,null,null,null,null,null,"2014-11-09","14/15","13/14","12/13",null,"2014-11-09","14/15","13/14","12/13"]
[null,null,null,null,null,null,null,"2014-11-10","14/15","13/14","12/13",null,"2014-11-10","14/15","13/14","12/13"]
[null,null,null,null,null,null,null,"2014-11-11","14/15","13/14","12/13",null,"2014-11-11","14/15","13/14","12/13"]
[null,null,null,null,null,null,null,"2014-11-12","14/15","13/14","12/13",null,"2014-11-12","14/15","13/14","12/13"]
[null,null,null,null,null,null,null,"2014-11-13","14/15","13/14","12/13",null,"2014-11-13","14/15","13/14","12/13"]
[null,null,null,null,null,null,null,"2014-11-14","14/15","13/14","12/13",null,"2014-11-14","14/15","13/14","12/13"]
[null,null,null,null,null,null,null,"2014-11-15","14/15","13/14","12/13",null,"2014-11-15","14/15","13/14","12/13"]
[null,null,null,null,null,null,null,"2014-11-16","14/15","13/14","12/13",null,"2014-11-16","14/15","13/14","12/13"]
[null,null,null,null,null,null,null,"2014-11-17","14/15","13/14","12/13",null,"2014-11-17","14/15","13/14","12/13"]
[null,null,null,null,null,null,null,"2014-11-18","14/15","13/14","12/13",null,"2014-11-18","14/15","13/14","12/13"]
[null,null,null,null,null,null,null,"2014-11-19","14/15","13/14","12/13",null,"2014-11-19","14/15","13/14","12/13"]
[null,null,null,null,null,null,null,"2014-11-20","14/15","13/14","12/13",null,"2014-11-20","14/15","13/14","12/13"]
[null,null,null,null,null,null,null,"2014-11-21","14/15","13/14","12/13",null,"2014-11-21","14/15","13/14","12/13"]
[null,null,null,null,null,null,null,"2014-11-22","14/15","13/14","12/13",null,"2014-11-22","14/15","13/14","12/13"]
[null,null,null,null,null,null,null,"2014-11-23","14/15","13/14","12/13",null,"2014-11-23","14/15","13/14","12/13"]
[null,null,null,null,null,null,null,"2014-11-24","14/15","13/14","12/13",null,"2014-11-24","14/15","13/14","12/13"]
[null,null,null,null,null,null,null,"2014-11-25","14/15","13/14","12/13",null,"2014-11-25","14/15","13/14","12/13"]
[null,null,null,null,null,null,null,"2014-11-26","14/15","13/14","12/13",null,"2014-11-26","14/15","13/14","12/13"]
[null,null,null,null,null,null,null,"2014-11-27","14/15","13/14","12/13",null,"2014-11-27","14/15","13/14","12/13"]
[null,null,null,null,null,null,null,"2014-11-28","14/15","13/14","12/13",null,"2014-11-28","14/15","13/14","12/13"]
[null,null,null,null,null,null,null,"2014-11-29","14/15","13/14","12/13",null,"2014-11-29","14/15","13/14","12/13"]
[null,null,null,null,null,null,null,"2014-11-30","14/15","13/14","12/13",null,"2014-11-30","14/15","13/14","12/13"]
[null,null,null,null,null,null,null,"2014-12-01","14/15","13/14","12/13",null,"2014-12-01","14/15","13/14","12/13"]
[null,null,null,null,null,null,null,"2014-12-02","14/15","13/14","12/13",null,"2014-12-02","14/15","13/14","12/13"]
[null,null,null,null,null,null,null,"2014-12-03","14/15","13/14","12/13",null,"2014-12-03","14/15","13/14","12/13"]
[null,null,null,null,null,null,null,"2014-12-04","14/15","13/14","12/13",null,"2014-12-04","14/15","13/14","12/13"]
[null,null,null,null,null,null,null,"2014-12-05","14/15","13/14","12/13",null,"2014-12-05","14/15","13/14","12/13"]
[null,null,null,null,null,null,null,"2014-12-06","14/15","13/14","12/13",null,"2014-12-06","14/15","13/14","12/13"]
[null,null,null,null,null,null,null,"2014-12-07","14/15","13/14","12/13",null,"2014-12-07","14/15","13/14","12/13"]
[null,null,null,null,null,null,null,"2014-12-08","14/15","13/14","12/13",null,"2014-12-08","14/15","13/14","12/13"]
[null,null,null,null,null,null,null,"2014-12-09","14/15","13/14","12/13",null,"2014-12-09","14/15","13/14","12/13"]
[null,null,null,null,null,null,null,"2014-12-10","14/15","13/14","12/13",null,"2014-12-10","14/15","13/14","12/13"]
[null,null,null,null,null,null,null,"2014-12-11","14/15","13/14","12/13",null,"2014-12-11","14/15","13/14","12/13"]
[null,null,null,null,null,null,null,"2014-12-12","14/15","13/14","12/13",null,"2014-12-12","14/15","13/14","12/13"]
[null,null,null,null,null,null,null,"2014-12-13","14/15","13/14","12/13",null,"2014-12-13","14/15","13/14","12/13"]
[null,null,null,null,null,null,null,"2014-12-14","14/15","13/14","12/13",null,"2014-12-14","14/15","13/14","12/13"]
[null,null,null,null,null,null,null,"2014-12-15","14/15","13/14","12/13",null,"2014-12-15","14/15","13/14","12/13"]
[null,null,null,null,null,null,null,"2014-12-16","14/15","13/14","12/13",null,"2014-12-16","14/15","13/14","12/13"]
[null,null,null,null,null,null,null,"2014-12-17","14/15","13/14","12/13",null,"2014-12-17","14/15","13/14","12/13"]
[null,null,null,null,null,null,null,"2014-12-18","14/15","13/14","12/13",null,"2014-12-18","14/15","13/14","12/13"]
[null,null,null,null,null,null,null,"2014-12-19","14/15","13/14","12/13",null,"2014-12-19","14/15","13/14","12/13"]
[null,null,null,null,null,null,null,"2014-12-20","14/15","13/14","12/13",null,"2014-12-20","14/15","13/14","12/13"]
[null,null,null,null,null,null,null,"2014-12-21","14/15","13/14","12/13",null,"2014-12-21","14/15","13/14","12/13"]
[null,null,null,null,null,null,null,"2014-12-22","14/15","13/14","12/13",null,"2014-12-22","14/15","13/14","12/13"]
[null,null,null,null,null,null,null,"2014-12-23","14/15","13/14","12/13",null,"2014-12-23","14/15","13/14","12/13"]
[null,null,null,null,null,null,null,"2014-12-24","14/15","13/14","12/13",null,"2014-12-24","14/15","13/14","12/13"]
[null,null,null,null,null,null,null,"2014-12-25","14/15","13/14","12/13",null,"2014-12-25","14/15","13/14","12/13"]
[null,null,null,null,null,null,null,"2014-12-26","14/15","13/14","12/13",null,"2014-12-26","14/15","13/14","12/13"]
[null,null,null,null,null,null,null,"2014-12-27","14/15","13/14","12/13",null,"2014-12-27","14/15","13/14","12/13"]
[null,null,null,null,null,null,null,"2014-12-28","14/15","13/14","12/13",null,"2014-12-28","14/15","13/14","12/13"]
[null,null,null,null,null,null,null,"2014-12-29","14/15","13/14","12/13",null,"2014-12-29","14/15","13/14","12/13"]
[null,null,null,null,null,null,null,"2014-12-30","14/15","13/14","12/13",null,"2014-12-30","14/15","13/14","12/13"]
[null,null,null,null,null,null,null,"2014-12-31","14/15","13/14","12/13",null,"2014-12-31","14/15","13/14","12/13"]
[null,null,null,null,null,null,null,"2015-01-01","14/15","13/14","12/13",null,"2015-01-01","14/15","13/14","12/13"]
[null,null,null,null,null,null,null,"2015-01-02","14/15","13/14","12/13",null,"2015-01-02","14/15","13/14","12/13"]
[null,null,null,null,null,null,null,"2015-01-03","14/15","13/14","12/13",null,"2015-01-03","14/15","13/14","12/13"]
[null,null,null,null,null,null,null,"2015-01-04","14/15","13/14","12/13",null,"2015-01-04","14/15","13/14","12/13"]
[null,null,null,null,null,null,null,"2015-01-05","14/15","13/14","12/13",null,"2015-01-05","14/15","13/14","12/13"]
[null,null,null,null,null,null,null,"2015-01-06","14/15","13/14","12/13",null,"2015-01-06","14/15","13/14","12/13"]
[null,null,null,null,null,null,null,"2015-01-07","14/15","13/14","12/13",null,"2015-01-07","14/15","13/14","12/13"]
[null,null,null,null,null,null,null,"2015-01-08","14/15","13/14","12/13",null,"2015-01-08","14/15","13/14","12/13"]
[null,null,null,null,null,null,null,"2015-01-09","14/15","13/14","12/13",null,"2015-01-09","14/15","13/14","12/13"]
[null,null,null,null,null,null,null,"2015-01-10","14/15","13/14","12/13",null,"2015-01-10","14/15","13/14","12/13"]
[null,null,null,null,null,null,null,"2015-01-11","14/15","13/14","12/13",null,"2015-01-11","14/15","13/14","12/13"]
[null,null,null,null,null,null,null,"2015-01-12","14/15","13/14","12/13",null,"2015-01-12","14/15","13/14","12/13"]
[null,null,null,null,null,null,null,"2015-01-13","14/15","13/14","12/13",null,"2015-01-13","14/15","13/14","12/13"]
[null,null,null,null,null,null,null,"2015-01-14","14/15","13/14","12/13",null,"2015-01-14","14/15","13/14","12/13"]
[null,null,null,null,null,null,null,"2015-01-15","14/15","13/14","12/13",null,"2015-01-15","14/15","13/14","12/13"]
[null,null,null,null,null,null,null,"2015-01-16","14/15","13/14","12/13",null,"2015-01-16","14/15","13/14","12/13"]
[null,null,null,null,null,null,null,"2015-01-17","14/15","13/14","12/13",null,"2015-01-17","14/15","13/14","12/13"]
[null,null,null,null,null,null,null,"2015-01-18","14/15","13/14","12/13",null,"2015-01-18","14/15","13/14","12/13"]
[null,null,null,null,null,null,null,"2015-01-19","14/15","13/14","12/13",null,"2015-01-19","14/15","13/14","12/13"]
[null,null,null,null,null,null,null,"2015-01-20","14/15","13/14","12/13",null,"2015-01-20","14/15","13/14","12/13"]
[null,null,null,null,null,null,null,"2015-01-21","14/15","13/14","12/13",null,"2015-01-21","14/15","13/14","12/13"]
[null,null,null,null,null,null,null,"2015-01-22","14/15","13/14","12/13",null,"2015-01-22","14/15","13/14","12/13"]
[null,null,null,null,null,null,null,"2015-01-23","14/15","13/14","12/13",null,"2015-01-23","14/15","13/14","12/13"]
[null,null,null,null,null,null,null,"2015-01-24","14/15","13/14","12/13",null,"2015-01-24","14/15","13/14","12/13"]
[null,null,null,null,null,null,null,"2015-01-25","14/15","13/14","12/13",null,"2015-01-25","14/15","13/14","12/13"]
[null,null,null,null,null,null,null,"2015-01-26","14/15","13/14","12/13",null,"2015-01-26","14/15","13/14","12/13"]
[null,null,null,null,null,null,null,"2015-01-27","14/15","13/14","12/13",null,"2015-01-27","14/15","13/14","12/13"]
[null,null,null,null,null,null,null,"2015-01-28","14/15","13/14","12/13",null,"2015-01-28","14/15","13/14","12/13"]
[null,null,null,null,null,null,null,"2015-01-29","14/15","13/14","12/13",null,"2015-01-29","14/15","13/14","12/13"]
[null,null,null,null,null,null,null,"2015-01-30","14/15","13/14","12/13",null,"2015-01-30","14/15","13/14","12/13"]
[null,null,null,null,null,null,null,"2015-01-31","14/15","13/14","12/13",null,"2015-01-31","14/15","13/14","12/13"]
[null,null,null,null,null,null,null,"2015-02-01","14/15","13/14","12/13",null,"2015-02-01","14/15","13/14","12/13"]
[null,null,null,null,null,null,null,"2015-02-02","14/15","13/14","12/13",null,"2015-02-02","14/15","13/14","12/13"]
[null,null,null,null,null,null,null,"2015-02-03","14/15","13/14","12/13",null,"2015-02-03","14/15","13/14","12/13"]
[null,null,null,null,null,null,null,"2015-02-04","14/15","13/14","12/13",null,"2015-02-04","14/15","13/14","12/13"]
[null,null,null,null,null,null,null,"2015-02-05","14/15","13/14","12/13",null,"2015-02-05","14/15","13/14","12/13"]
[null,null,null,null,null,null,null,"2015-02-06","14/15","13/14","12/13",null,"2015-02-06","14/15","13/14","12/13"]
[null,null,null,null,null,null,null,"2015-02-07","14/15","13/14","12/13",null,"2015-02-07","14/15","13/14","12/13"]
[null,null,null,null,null,null,null,"2015-02-08","14/15","13/14","12/13",null,"2015-02-08","14/15","13/14","12/13"]
[null,null,null,null,null,null,null,"2015-02-09","14/15","13/14","12/13",null,"2015-02-09","14/15","13/14","12/13"]
[null,null,null,null,null,null,null,"2015-02-10","14/15","13/14","12/13",null,"2015-02-10","14/15","13/14","12/13"]
[null,null,null,null,null,null,null,"2015-02-11","14/15","13/14","12/13",null,"2015-02-11","14/15","13/14","12/13"]
[null,null,null,null,null,null,null,"2015-02-12","14/15","13/14","12/13",null,"2015-02-12","14/15","13/14","12/13"]
[null,null,null,null,null,null,null,"2015-02-13","14/15","13/14","12/13",null,"2015-02-13","14/15","13/14","12/13"]
[null,null,null,null,null,null,null,"2015-02-14","14/15","13/14","12/13",null,"2015-02-14","14/15","13/14","12/13"]
[null,null,null,null,null,null,null,"2015-02-15","14/15","13/14","12/13",null,"2015-02-15","14/15","13/14","12/13"]
[null,null,null,null,null,null,null,"2015-02-16","14/15","13/14","12/13",null,"2015-02-16","14/15","13/14","12/13"]
[null,null,null,null,null,null,null,"2015-02-17","14/15","13/14","12/13",null,"2015-02-17","14/15","13/14","12/13"]
[null,null,null,null,null,null,null,"2015-02-18","14/15","13/14","12/13",null,"2015-02-18","14/15","13/14","12/13"]
[null,null,null,null,null,null,null,"2015-02-19","14/15","13/14","12/13",null,"2015-02-19","14/15","13/14","12/13"]
[null,null,null,null,null,null,null,"2015-02-20","14/15","13/14","12/13",null,"2015-02-20","14/15","13/14","12/13"]
[null,null,null,null,null,null,null,"2015-02-21","14/15","13/14","12/13",null,"2015-02-21","14/15","13/14","12/13"]
[null,null,null,null,null,null,null,"2015-02-22","14/15","13/14","12/13",null,"2015-02-22","14/15","13/14","12/13"]
[null,null,null,null,null,null,null,"2015-02-23","14/15","13/14","12/13",null,"2015-02-23","14/15","13/14","12/13"]
[null,null,null,null,null,null,null,"2015-02-24","14/15","13/14","12/13",null,"2015-02-24","14/15","13/14","12/13"]
[null,null,null,null,null,null,null,"2015-02-25","14/15","13/14","12/13",null,"2015-02-25","14/15","13/14","12/13"]
[null,null,null,null,null,null,null,"2015-02-26","14/15","13/14","12/13",null,"2015-02-26","14/15","13/14","12/13"]
[null,null,null,null,null,null,null,"2015-02-27","14/15","13/14","12/13",null,"2015-02-27","14/15","13/14","12/13"]
[null,null,null,null,null,null,null,"2015-02-28","14/15","13/14","12/13",null,"2015-02-28","14/15","13/14","12/13"]
[null,null,null,null,null,null,null,"2015-03-01","14/15","13/14","12/13",null,"2015-03-01","14/15","13/14","12/13"]
[null,null,null,null,null,null,null,"2015-03-02","14/15","13/14","12/13",null,"2015-03-02","14/15","13/14","12/13"]
[null,null,null,null,null,null,null,"2015-03-03","14/15","13/14","12/13",null,"2015-03-03","14/15","13/14","12/13"]
[null,null,null,null,null,null,null,"2015-03-04","14/15","13/14","12/13",null,"2015-03-04","14/15","13/14","12/13"]
[null,null,null,null,null,null,null,"2015-03-05","14/15","13/14","12/13",null,"2015-03-05","14/15","13/14","12/13"]
[null,null,null,null,null,null,null,"2015-03-06","14/15","13/14","12/13",null,"2015-03-06","14/15","13/14","12/13"]
[null,null,null,null,null,null,null,"2015-03-07","14/15","13/14","12/13",null,"2015-03-07","14/15","13/14","12/13"]
[null,null,null,null,null,null,null,"2015-03-08","14/15","13/14","12/13",null,"2015-03-08","14/15","13/14","12/13"]
[null,null,null,null,null,null,null,"2015-03-09","14/15","13/14","12/13",null,"2015-03-09","14/15","13/14","12/13"]
[null,null,null,null,null,null,null,"2015-03-10","14/15","13/14","12/13",null,"2015-03-10","14/15","13/14","12/13"]
[null,null,null,null,null,null,null,"2015-03-11","14/15","13/14","12/13",null,"2015-03-11","14/15","13/14","12/13"]
[null,null,null,null,null,null,null,"2015-03-12","14/15","13/14","12/13",null,"2015-03-12","14/15","13/14","12/13"]
[null,null,null,null,null,null,null,"2015-03-13","14/15","13/14","12/13",null,"2015-03-13","14/15","13/14","12/13"]
[null,null,null,null,null,null,null,"2015-03-14","14/15","13/14","12/13",null,"2015-03-14","14/15","13/14","12/13"]
[null,null,null,null,null,null,null,"2015-03-15","14/15","13/14","12/13",null,"2015-03-15","14/15","13/14","12/13"]
[null,null,null,null,null,null,null,"2015-03-16","14/15","13/14","12/13",null,"2015-03-16","14/15","13/14","12/13"]
[null,null,null,null,null,null,null,"2015-03-17","14/15","13/14","12/13",null,"2015-03-17","14/15","13/14","12/13"]
[null,null,null,null,null,null,null,"2015-03-18","14/15","13/14","12/13",null,"2015-03-18","14/15","13/14","12/13"]
[null,null,null,null,null,null,null,"2015-03-19","14/15","13/14","12/13",null,"2015-03-19","14/15","13/14","12/13"]
[null,null,null,null,null,null,null,"2015-03-20","14/15","13/14","12/13",null,"2015-03-20","14/15","13/14","12/13"]
[null,null,null,null,null,null,null,"2015-03-21","14/15","13/14","12/13",null,"2015-03-21","14/15","13/14","12/13"]
[null,null,null,null,null,null,null,"2015-03-22","14/15","13/14","12/13",null,"2015-03-22","14/15","13/14","12/13"]
[null,null,null,null,null,null,null,"2015-03-23","14/15","13/14","12/13",null,"2015-03-23","14/15","13/14","12/13"]
[null,null,null,null,null,null,null,"2015-03-24","14/15","13/14","12/13",null,"2015-03-24","14/15","13/14","12/13"]
[null,null,null,null,null,null,null,"2015-03-25","14/15","13/14","12/13",null,"2015-03-25","14/15","13/14","12/13"]
[null,null,null,null,null,null,null,"2015-03-26","14/15","13/14","12/13",null,"2015-03-26","14/15","13/14","12/13"]
[null,null,null,null,null,null,null,"2015-03-27","14/15","13/14","12/13",null,"2015-03-27","14/15","13/14","12/13"]
[null,null,null,null,null,null,null,"2015-03-28","14/15","13/14","12/13",null,"2015-03-28","14/15","13/14","12/13"]
[null,null,null,null,null,null,null,"2015-03-29","14/15","13/14","12/13",null,"2015-03-29","14/15","13/14","12/13"]
[null,null,null,null,null,null,null,"2015-03-30","14/15","13/14","12/13",null,"2015-03-30","14/15","13/14","12/13"]
[null,null,null,null,null,null,null,"2015-03-31","14/15","13/14","12/13",null,"2015-03-31","14/15","13/14","12/13"]
[null,null,null,null,null,null,null,"2015-04-01","14/15","13/14","12/13",null,"2015-04-01","14/15","13/14","12/13"]
[null,null,null,null,null,null,null,"2015-04-02","14/15","13/14","12/13",null,"2015-04-02","14/15","13/14","12/13"]
[null,null,null,null,null,null,null,"2015-04-03","14/15","13/14","12/13",null,"2015-04-03","14/15","13/14","12/13"]
[null,null,null,null,null,null,null,"2015-04-04","14/15","13/14","12/13",null,"2015-04-04","14/15","13/14","12/13"]
[null,null,null,null,null,null,null,"2015-04-05","14/15","13/14","12/13",null,"2015-04-05","14/15","13/14","12/13"]
[null,null,null,null,null,null,null,"2015-04-06","15/16","14/15","13/14",null,"2015-04-06","15/16","14/15","13/14"]
[null,null,null,null,null,null,null,"2015-04-07","15/16","14/15","13/14",null,"2015-04-07","15/16","14/15","13/14"]
[null,null,null,null,null,null,null,"2015-04-08","15/16","14/15","13/14",null,"2015-04-08","15/16","14/15","13/14"]
[null,null,null,null,null,null,null,"2015-04-09","15/16","14/15","13/14",null,"2015-04-09","15/16","14/15","13/14"]
[null,null,null,null,null,null,null,"2015-04-10","15/16","14/15","13/14",null,"2015-04-10","15/16","14/15","13/14"]
[null,null,null,null,null,null,null,"2015-04-11","15/16","14/15","13/14",null,"2015-04-11","15/16","14/15","13/14"]
[null,null,null,null,null,null,null,"2015-04-12","15/16","14/15","13/14",null,"2015-04-12","15/16","14/15","13/14"]
[null,null,null,null,null,null,null,"2015-04-13","15/16","14/15","13/14",null,"2015-04-13","15/16","14/15","13/14"]
[null,null,null,null,null,null,null,"2015-04-14","15/16","14/15","13/14",null,"2015-04-14","15/16","14/15","13/14"]
[null,null,null,null,null,null,null,"2015-04-15","15/16","14/15","13/14",null,"2015-04-15","15/16","14/15","13/14"]
[null,null,null,null,null,null,null,"2015-04-16","15/16","14/15","13/14",null,"2015-04-16","15/16","14/15","13/14"]
[null,null,null,null,null,null,null,"2015-04-17","15/16","14/15","13/14",null,"2015-04-17","15/16","14/15","13/14"]
[null,null,null,null,null,null,null,"2015-04-18","15/16","14/15","13/14",null,"2015-04-18","15/16","14/15","13/14"]
[null,null,null,null,null,null,null,"2015-04-19","15/16","14/15","13/14",null,"2015-04-19","15/16","14/15","13/14"]
[null,null,null,null,null,null,null,"2015-04-20","15/16","14/15","13/14",null,"2015-04-20","15/16","14/15","13/14"]
[null,null,null,null,null,null,null,"2015-04-21","15/16","14/15","13/14",null,"2015-04-21","15/16","14/15","13/14"]
[null,null,null,null,null,null,null,"2015-04-22","15/16","14/15","13/14",null,"2015-04-22","15/16","14/15","13/14"]
[null,null,null,null,null,null,null,"2015-04-23","15/16","14/15","13/14",null,"2015-04-23","15/16","14/15","13/14"]
[null,null,null,null,null,null,null,"2015-04-24","15/16","14/15","13/14",null,"2015-04-24","15/16","14/15","13/14"]
[null,null,null,null,null,null,null,"2015-04-25","15/16","14/15","13/14",null,"2015-04-25","15/16","14/15","13/14"]
[null,null,null,null,null,null,null,"2015-04-26","15/16","14/15","13/14",null,"2015-04-26","15/16","14/15","13/14"]
[null,null,null,null,null,null,null,"2015-04-27","15/16","14/15","13/14",null,"2015-04-27","15/16","14/15","13/14"]
[null,null,null,null,null,null,null,"2015-04-28","15/16","14/15","13/14",null,"2015-04-28","15/16","14/15","13/14"]
[null,null,null,null,null,null,null,"2015-04-29","15/16","14/15","13/14",null,"2015-04-29","15/16","14/15","13/14"]
[null,null,null,null,null,null,null,"2015-04-30","15/16","14/15","13/14",null,"2015-04-30","15/16","14/15","13/14"]
[null,null,null,null,null,null,null,"2015-05-01","15/16","14/15","13/14",null,"2015-05-01","15/16","14/15","13/14"]
[null,null,null,null,null,null,null,"2015-05-02","15/16","14/15","13/14",null,"2015-05-02","15/16","14/15","13/14"]
[null,null,null,null,null,null,null,"2015-05-03","15/16","14/15","13/14",null,"2015-05-03","15/16","14/15","13/14"]
[null,null,null,null,null,null,null,"2015-05-04","15/16","14/15","13/14",null,"2015-05-04","15/16","14/15","13/14"]
[null,null,null,null,null,null,null,"2015-05-05","15/16","14/15","13/14",null,"2015-05-05","15/16","14/15","13/14"]
[null,null,null,null,null,null,null,"2015-05-06","15/16","14/15","13/14",null,"2015-05-06","15/16","14/15","13/14"]
[null,null,null,null,null,null,null,"2015-05-07","15/16","14/15","13/14",null,"2015-05-07","15/16","14/15","13/14"]
[null,null,null,null,null,null,null,"2015-05-08","15/16","14/15","13/14",null,"2015-05-08","15/16","14/15","13/14"]
[null,null,null,null,null,null,null,"2015-05-09","15/16","14/15","13/14",null,"2015-05-09","15/16","14/15","13/14"]
[null,null,null,null,null,null,null,"2015-05-10","15/16","14/15","13/14",null,"2015-05-10","15/16","14/15","13/14"]
[null,null,null,null,null,null,null,"2015-05-11","15/16","14/15","13/14",null,"2015-05-11","15/16","14/15","13/14"]
[null,null,null,null,null,null,null,"2015-05-12","15/16","14/15","13/14",null,"2015-05-12","15/16","14/15","13/14"]
[null,null,null,null,null,null,null,"2015-05-13","15/16","14/15","13/14",null,"2015-05-13","15/16","14/15","13/14"]
[null,null,null,null,null,null,null,"2015-05-14","15/16","14/15","13/14",null,"2015-05-14","15/16","14/15","13/14"]
[null,null,null,null,null,null,null,"2015-05-15","15/16","14/15","13/14",null,"2015-05-15","15/16","14/15","13/14"]
[null,null,null,null,null,null,null,"2015-05-16","15/16","14/15","13/14",null,"2015-05-16","15/16","14/15","13/14"]
[null,null,null,null,null,null,null,"2015-05-17","15/16","14/15","13/14",null,"2015-05-17","15/16","14/15","13/14"]
[null,null,null,null,null,null,null,"2015-05-18","15/16","14/15","13/14",null,"2015-05-18","15/16","14/15","13/14"]
[null,null,null,null,null,null,null,"2015-05-19","15/16","14/15","13/14",null,"2015-05-19","15/16","14/15","13/14"]
[null,null,null,null,null,null,null,"2015-05-20","15/16","14/15","13/14",null,"2015-05-20","15/16","14/15","13/14"]
[null,null,null,null,null,null,null,"2015-05-21","15/16","14/15","13/14",null,"2015-05-21","15/16","14/15","13/14"]
[null,null,null,null,null,null,null,"2015-05-22","15/16","14/15","13/14",null,"2015-05-22","15/16","14/15","13/14"]
[null,null,null,null,null,null,null,"2015-05-23","15/16","14/15","13/14",null,"2015-05-23","15/16","14/15","13/14"]
[null,null,null,null,null,null,null,"2015-05-24","15/16","14/15","13/14",null,"2015-05-24","15/16","14/15","13/14"]
[null,null,null,null,null,null,null,"2015-05-25","15/16","14/15","13/14",null,"2015-05-25","15/16","14/15","13/14"]
[null,null,null,null,null,null,null,"2015-05-26","15/16","14/15","13/14",null,"2015-05-26","15/16","14/15","13/14"]
[null,null,null,null,null,null,null,"2015-05-27","15/16","14/15","13/14",null,"2015-05-27","15/16","14/15","13/14"]
[null,null,null,null,null,null,null,"2015-05-28","15/16","14/15","13/14",null,"2015-05-28","15/16","14/15","13/14"]
[null,null,null,null,null,null,null,"2015-05-29","15/16","14/15","13/14",null,"2015-05-29","15/16","14/15","13/14"]
[null,null,null,null,null,null,null,"2015-05-30","15/16","14/15","13/14",null,"2015-05-30","15/16","14/15","13/14"]
[null,null,null,null,null,null,null,"2015-05-31","15/16","14/15","13/14",null,"2015-05-31","15/16","14/15","13/14"]
[null,null,null,null,null,null,null,"2015-06-01","15/16","14/15","13/14",null,"2015-06-01","15/16","14/15","13/14"]
[null,null,null,null,null,null,null,"2015-06-02","15/16","14/15","13/14",null,"2015-06-02","15/16","14/15","13/14"]
[null,null,null,null,null,null,null,"2015-06-03","15/16","14/15","13/14",null,"2015-06-03","15/16","14/15","13/14"]
[null,null,null,null,null,null,null,"2015-06-04","15/16","14/15","13/14",null,"2015-06-04","15/16","14/15","13/14"]
[null,null,null,null,null,null,null,"2015-06-05","15/16","14/15","13/14",null,"2015-06-05","15/16","14/15","13/14"]
[null,null,null,null,null,null,null,"2015-06-06","15/16","14/15","13/14",null,"2015-06-06","15/16","14/15","13/14"]
[null,null,null,null,null,null,null,"2015-06-07","15/16","14/15","13/14",null,"2015-06-07","15/16","14/15","13/14"]
[null,null,null,null,null,null,null,"2015-06-08","15/16","14/15","13/14",null,"2015-06-08","15/16","14/15","13/14"]
[null,null,null,null,null,null,null,"2015-06-09","15/16","14/15","13/14",null,"2015-06-09","15/16","14/15","13/14"]
[null,null,null,null,null,null,null,"2015-06-10","15/16","14/15","13/14",null,"2015-06-10","15/16","14/15","13/14"]
[null,null,null,null,null,null,null,"2015-06-11","15/16","14/15","13/14",null,"2015-06-11","15/16","14/15","13/14"]
[null,null,null,null,null,null,null,"2015-06-12","15/16","14/15","13/14",null,"2015-06-12","15/16","14/15","13/14"]
[null,null,null,null,null,null,null,"2015-06-13","15/16","14/15","13/14",null,"2015-06-13","15/16","14/15","13/14"]
[null,null,null,null,null,null,null,"2015-06-14","15/16","14/15","13/14",null,"2015-06-14","15/16","14/15","13/14"]
[null,null,null,null,null,null,null,"2015-06-15","15/16","14/15","13/14",null,"2015-06-15","15/16","14/15","13/14"]
[null,null,null,null,null,null,null,"2015-06-16","15/16","14/15","13/14",null,"2015-06-16","15/16","14/15","13/14"]
[null,null,null,null,null,null,null,"2015-06-17","15/16","14/15","13/14",null,"2015-06-17","15/16","14/15","13/14"]
[null,null,null,null,null,null,null,"2015-06-18","15/16","14/15","13/14",null,"2015-06-18","15/16","14/15","13/14"]
[null,null,null,null,null,null,null,"2015-06-19","15/16","14/15","13/14",null,"2015-06-19","15/16","14/15","13/14"]
[null,null,null,null,null,null,null,"2015-06-20","15/16","14/15","13/14",null,"2015-06-20","15/16","14/15","13/14"]
[null,null,null,null,null,null,null,"2015-06-21","15/16","14/15","13/14",null,"2015-06-21","15/16","14/15","13/14"]
[null,null,null,null,null,null,null,"2015-06-22","15/16","14/15","13/14",null,"2015-06-22","15/16","14/15","13/14"]
[null,null,null,null,null,null,null,"2015-06-23","15/16","14/15","13/14",null,"2015-06-23","15/16","14/15","13/14"]
[null,null,null,null,null,null,null,"2015-06-24","15/16","14/15","13/14",null,"2015-06-24","15/16","14/15","13/14"]
[null,null,null,null,null,null,null,"2015-06-25","15/16","14/15","13/14",null,"2015-06-25","15/16","14/15","13/14"]
[null,null,null,null,null,null,null,"2015-06-26","15/16","14/15","13/14",null,"2015-06-26","15/16","14/15","13/14"]
[null,null,null,null,null,null,null,"2015-06-27","15/16","14/15","13/14",null,"2015-06-27","15/16","14/15","13/14"]
[null,null,null,null,null,null,null,"2015-06-28","15/16","14/15","13/14",null,"2015-06-28","15/16","14/15","13/14"]
[null,null,null,null,null,null,null,"2015-06-29","15/16","14/15","13/14",null,"2015-06-29","15/16","14/15","13/14"]
[null,null,null,null,null,null,null,"2015-06-30","15/16","14/15","13/14",null,"2015-06-30","15/16","14/15","13/14"]
[null,null,null,null,null,null,null,"2015-07-01","15/16","14/15","13/14",null,"2015-07-01","15/16","14/15","13/14"]
[null,null,null,null,null,null,null,"2015-07-02","15/16","14/15","13/14",null,"2015-07-02","15/16","14/15","13/14"]
[null,null,null,null,null,null,null,"2015-07-03","15/16","14/15","13/14",null,"2015-07-03","15/16","14/15","13/14"]
[null,null,null,null,null,null,null,"2015-07-04","15/16","14/15","13/14",null,"2015-07-04","15/16","14/15","13/14"]
[null,null,null,null,null,null,null,"2015-07-05","15/16","14/15","13/14",null,"2015-07-05","15/16","14/15","13/14"]
[null,null,null,null,null,null,null,"2015-07-06","15/16","14/15","13/14",null,"2015-07-06","15/16","14/15","13/14"]
[null,null,null,null,null,null,null,"2015-07-07","15/16","14/15","13/14",null,"2015-07-07","15/16","14/15","13/14"]
[null,null,null,null,null,null,null,"2015-07-08","15/16","14/15","13/14",null,"2015-07-08","15/16","14/15","13/14"]
[null,null,null,null,null,null,null,"2015-07-09","15/16","14/15","13/14",null,"2015-07-09","15/16","14/15","13/14"]
[null,null,null,null,null,null,null,"2015-07-10","15/16","14/15","13/14",null,"2015-07-10","15/16","14/15","13/14"]
[null,null,null,null,null,null,null,"2015-07-11","15/16","14/15","13/14",null,"2015-07-11","15/16","14/15","13/14"]
[null,null,null,null,null,null,null,"2015-07-12","15/16","14/15","13/14",null,"2015-07-12","15/16","14/15","13/14"]
[null,null,null,null,null,null,null,"2015-07-13","15/16","14/15","13/14",null,"2015-07-13","15/16","14/15","13/14"]
[null,null,null,null,null,null,null,"2015-07-14","15/16","14/15","13/14",null,"2015-07-14","15/16","14/15","13/14"]
[null,null,null,null,null,null,null,"2015-07-15","15/16","14/15","13/14",null,"2015-07-15","15/16","14/15","13/14"]
[null,null,null,null,null,null,null,"2015-07-16","15/16","14/15","13/14",null,"2015-07-16","15/16","14/15","13/14"]
[null,null,null,null,null,null,null,"2015-07-17","15/16","14/15","13/14",null,"2015-07-17","15/16","14/15","13/14"]
[null,null,null,null,null,null,null,"2015-07-18","15/16","14/15","13/14",null,"2015-07-18","15/16","14/15","13/14"]
[null,null,null,null,null,null,null,"2015-07-19","15/16","14/15","13/14",null,"2015-07-19","15/16","14/15","13/14"]
[null,null,null,null,null,null,null,"2015-07-20","15/16","14/15","13/14",null,"2015-07-20","15/16","14/15","13/14"]
[null,null,null,null,null,null,null,"2015-07-21","15/16","14/15","13/14",null,"2015-07-21","15/16","14/15","13/14"]
[null,null,null,null,null,null,null,"2015-07-22","15/16","14/15","13/14",null,"2015-07-22","15/16","14/15","13/14"]
[null,null,null,null,null,null,null,"2015-07-23","15/16","14/15","13/14",null,"2015-07-23","15/16","14/15","13/14"]
[null,null,null,null,null,null,null,"2015-07-24","15/16","14/15","13/14",null,"2015-07-24","15/16","14/15","13/14"]
[null,null,null,null,null,null,null,"2015-07-25","15/16","14/15","13/14",null,"2015-07-25","15/16","14/15","13/14"]
[null,null,null,null,null,null,null,"2015-07-26","15/16","14/15","13/14",null,"2015-07-26","15/16","14/15","13/14"]
[null,null,null,null,null,null,null,"2015-07-27","15/16","14/15","13/14",null,"2015-07-27","15/16","14/15","13/14"]
[null,null,null,null,null,null,null,"2015-07-28","15/16","14/15","13/14",null,"2015-07-28","15/16","14/15","13/14"]
[null,null,null,null,null,null,null,"2015-07-29","15/16","14/15","13/14",null,"2015-07-29","15/16","14/15","13/14"]
[null,null,null,null,null,null,null,"2015-07-30","15/16","14/15","13/14",null,"2015-07-30","15/16","14/15","13/14"]
[null,null,null,null,null,null,null,"2015-07-31","15/16","14/15","13/14",null,"2015-07-31","15/16","14/15","13/14"]
[null,null,null,null,null,null,null,"2015-08-01","15/16","14/15","13/14",null,"2015-08-01","15/16","14/15","13/14"]
[null,null,null,null,null,null,null,"2015-08-02","15/16","14/15","13/14",null,"2015-08-02","15/16","14/15","13/14"]
[null,null,null,null,null,null,null,"2015-08-03","15/16","14/15","13/14",null,"2015-08-03","15/16","14/15","13/14"]
[null,null,null,null,null,null,null,"2015-08-04","15/16","14/15","13/14",null,"2015-08-04","15/16","14/15","13/14"]
[null,null,null,null,null,null,null,"2015-08-05","15/16","14/15","13/14",null,"2015-08-05","15/16","14/15","13/14"]
[null,null,null,null,null,null,null,"2015-08-06","15/16","14/15","13/14",null,"2015-08-06","15/16","14/15","13/14"]
[null,null,null,null,null,null,null,"2015-08-07","15/16","14/15","13/14",null,"2015-08-07","15/16","14/15","13/14"]
[null,null,null,null,null,null,null,"2015-08-08","15/16","14/15","13/14",null,"2015-08-08","15/16","14/15","13/14"]
[null,null,null,null,null,null,null,"2015-08-09","15/16","14/15","13/14",null,"2015-08-09","15/16","14/15","13/14"]
[null,null,null,null,null,null,null,"2015-08-10","15/16","14/15","13/14",null,"2015-08-10","15/16","14/15","13/14"]
[null,null,null,null,null,null,null,"2015-08-11","15/16","14/15","13/14",null,"2015-08-11","15/16","14/15","13/14"]
[null,null,null,null,null,null,null,"2015-08-12","15/16","14/15","13/14",null,"2015-08-12","15/16","14/15","13/14"]
[null,null,null,null,null,null,null,"2015-08-13","15/16","14/15","13/14",null,"2015-08-13","15/16","14/15","13/14"]
[null,null,null,null,null,null,null,"2015-08-14","15/16","14/15","13/14",null,"2015-08-14","15/16","14/15","13/14"]
[null,null,null,null,null,null,null,"2015-08-15","15/16","14/15","13/14",null,"2015-08-15","15/16","14/15","13/14"]
[null,null,null,null,null,null,null,"2015-08-16","15/16","14/15","13/14",null,"2015-08-16","15/16","14/15","13/14"]
[null,null,null,null,null,null,null,"2015-08-17","15/16","14/15","13/14",null,"2015-08-17","15/16","14/15","13/14"]
[null,null,null,null,null,null,null,"2015-08-18","15/16","14/15","13/14",null,"2015-08-18","15/16","14/15","13/14"]
[null,null,null,null,null,null,null,"2015-08-19","15/16","14/15","13/14",null,"2015-08-19","15/16","14/15","13/14"]
[null,null,null,null,null,null,null,"2015-08-20","15/16","14/15","13/14",null,"2015-08-20","15/16","14/15","13/14"]
[null,null,null,null,null,null,null,"2015-08-21","15/16","14/15","13/14",null,"2015-08-21","15/16","14/15","13/14"]
[null,null,null,null,null,null,null,"2015-08-22","15/16","14/15","13/14",null,"2015-08-22","15/16","14/15","13/14"]
[null,null,null,null,null,null,null,"2015-08-23","15/16","14/15","13/14",null,"2015-08-23","15/16","14/15","13/14"]
[null,null,null,null,null,null,null,"2015-08-24","15/16","14/15","13/14",null,"2015-08-24","15/16","14/15","13/14"]
[null,null,null,null,null,null,null,"2015-08-25","15/16","14/15","13/14",null,"2015-08-25","15/16","14/15","13/14"]
[null,null,null,null,null,null,null,"2015-08-26","15/16","14/15","13/14",null,"2015-08-26","15/16","14/15","13/14"]
[null,null,null,null,null,null,null,"2015-08-27","15/16","14/15","13/14",null,"2015-08-27","15/16","14/15","13/14"]
[null,null,null,null,null,null,null,"2015-08-28","15/16","14/15","13/14",null,"2015-08-28","15/16","14/15","13/14"]
[null,null,null,null,null,null,null,"2015-08-29","15/16","14/15","13/14",null,"2015-08-29","15/16","14/15","13/14"]
[null,null,null,null,null,null,null,"2015-08-30","15/16","14/15","13/14",null,"2015-08-30","15/16","14/15","13/14"]
[null,null,null,null,null,null,null,"2015-08-31","15/16","14/15","13/14",null,"2015-08-31","15/16","14/15","13/14"]
[null,null,null,null,null,null,null,"2015-09-01","15/16","14/15","13/14",null,"2015-09-01","15/16","14/15","13/14"]
[null,null,null,null,null,null,null,"2015-09-02","15/16","14/15","13/14",null,"2015-09-02","15/16","14/15","13/14"]
[null,null,null,null,null,null,null,"2015-09-03","15/16","14/15","13/14",null,"2015-09-03","15/16","14/15","13/14"]
[null,null,null,null,null,null,null,"2015-09-04","15/16","14/15","13/14",null,"2015-09-04","15/16","14/15","13/14"]
[null,null,null,null,null,null,null,"2015-09-05","15/16","14/15","13/14",null,"2015-09-05","15/16","14/15","13/14"]
[null,null,null,null,null,null,null,"2015-09-06","15/16","14/15","13/14",null,"2015-09-06","15/16","14/15","13/14"]
[null,null,null,null,null,null,null,"2015-09-07","15/16","14/15","13/14",null,"2015-09-07","15/16","14/15","13/14"]
[null,null,null,null,null,null,null,"2015-09-08","15/16","14/15","13/14",null,"2015-09-08","15/16","14/15","13/14"]
[null,null,null,null,null,null,null,"2015-09-09","15/16","14/15","13/14",null,"2015-09-09","15/16","14/15","13/14"]
[null,null,null,null,null,null,null,"2015-09-10","15/16","14/15","13/14",null,"2015-09-10","15/16","14/15","13/14"]
[null,null,null,null,null,null,null,"2015-09-11","15/16","14/15","13/14",null,"2015-09-11","15/16","14/15","13/14"]
[null,null,null,null,null,null,null,"2015-09-12","15/16","14/15","13/14",null,"2015-09-12","15/16","14/15","13/14"]
[null,null,null,null,null,null,null,"2015-09-13","15/16","14/15","13/14",null,"2015-09-13","15/16","14/15","13/14"]
[null,null,null,null,null,null,null,"2015-09-14","15/16","14/15","13/14",null,"2015-09-14","15/16","14/15","13/14"]
[null,null,null,null,null,null,null,"2015-09-15","15/16","14/15","13/14",null,"2015-09-15","15/16","14/15","13/14"]
[null,null,null,null,null,null,null,"2015-09-16","15/16","14/15","13/14",null,"2015-09-16","15/16","14/15","13/14"]
[null,null,null,null,null,null,null,"2015-09-17","15/16","14/15","13/14",null,"2015-09-17","15/16","14/15","13/14"]
[null,null,null,null,null,null,null,"2015-09-18","15/16","14/15","13/14",null,"2015-09-18","15/16","14/15","13/14"]
[null,null,null,null,null,null,null,"2015-09-19","15/16","14/15","13/14",null,"2015-09-19","15/16","14/15","13/14"]
[null,null,null,null,null,null,null,"2015-09-20","15/16","14/15","13/14",null,"2015-09-20","15/16","14/15","13/14"]
[null,null,null,null,null,null,null,"2015-09-21","15/16","14/15","13/14",null,"2015-09-21","15/16","14/15","13/14"]
[null,null,null,null,null,null,null,"2015-09-22","15/16","14/15","13/14",null,"2015-09-22","15/16","14/15","13/14"]
[null,null,null,null,null,null,null,"2015-09-23","15/16","14/15","13/14",null,"2015-09-23","15/16","14/15","13/14"]
[null,null,null,null,null,null,null,"2015-09-24","15/16","14/15","13/14",null,"2015-09-24","15/16","14/15","13/14"]
[null,null,null,null,null,null,null,"2015-09-25","15/16","14/15","13/14",null,"2015-09-25","15/16","14/15","13/14"]
[null,null,null,null,null,null,null,"2015-09-26","15/16","14/15","13/14",null,"2015-09-26","15/16","14/15","13/14"]
[null,null,null,null,null,null,null,"2015-09-27","15/16","14/15","13/14",null,"2015-09-27","15/16","14/15","13/14"]
[null,null,null,null,null,null,null,"2015-09-28","15/16","14/15","13/14",null,"2015-09-28","15/16","14/15","13/14"]
[null,null,null,null,null,null,null,"2015-09-29","15/16","14/15","13/14",null,"2015-09-29","15/16","14/15","13/14"]
[null,null,null,null,null,null,null,"2015-09-30","15/16","14/15","13/14",null,"2015-09-30","15/16","14/15","13/14"]
[null,null,null,null,null,null,null,"2015-10-01","15/16","14/15","13/14",null,"2015-10-01","15/16","14/15","13/14"]
[null,null,null,null,null,null,null,"2015-10-02","15/16","14/15","13/14",null,"2015-10-02","15/16","14/15","13/14"]
[null,null,null,null,null,null,null,"2015-10-03","15/16","14/15","13/14",null,"2015-10-03","15/16","14/15","13/14"]
[null,null,null,null,null,null,null,"2015-10-04","15/16","14/15","13/14",null,"2015-10-04","15/16","14/15","13/14"]
[null,null,null,null,null,null,null,"2015-10-05","15/16","14/15","13/14",null,"2015-10-05","15/16","14/15","13/14"]
[null,null,null,null,null,null,null,"2015-10-06","15/16","14/15","13/14",null,"2015-10-06","15/16","14/15","13/14"]
[null,null,null,null,null,null,null,"2015-10-07","15/16","14/15","13/14",null,"2015-10-07","15/16","14/15","13/14"]
[null,null,null,null,null,null,null,"2015-10-08","15/16","14/15","13/14",null,"2015-10-08","15/16","14/15","13/14"]
[null,null,null,null,null,null,null,"2015-10-09","15/16","14/15","13/14",null,"2015-10-09","15/16","14/15","13/14"]
[null,null,null,null,null,null,null,"2015-10-10","15/16","14/15","13/14",null,"2015-10-10","15/16","14/15","13/14"]
[null,null,null,null,null,null,null,"2015-10-11","15/16","14/15","13/14",null,"2015-10-11","15/16","14/15","13/14"]
[null,null,null,null,null,null,null,"2015-10-12","15/16","14/15","13/14",null,"2015-10-12","15/16","14/15","13/14"]
[null,null,null,null,null,null,null,"2015-10-13","15/16","14/15","13/14",null,"2015-10-13","15/16","14/15","13/14"]
[null,null,null,null,null,null,null,"2015-10-14","15/16","14/15","13/14",null,"2015-10-14","15/16","14/15","13/14"]
[null,null,null,null,null,null,null,"2015-10-15","15/16","14/15","13/14",null,"2015-10-15","15/16","14/15","13/14"]
[null,null,null,null,null,null,null,"2015-10-16","15/16","14/15","13/14",null,"2015-10-16","15/16","14/15","13/14"]
[null,null,null,null,null,null,null,"2015-10-17","15/16","14/15","13/14",null,"2015-10-17","15/16","14/15","13/14"]
[null,null,null,null,null,null,null,"2015-10-18","15/16","14/15","13/14",null,"2015-10-18","15/16","14/15","13/14"]
[null,null,null,null,null,null,null,"2015-10-19","15/16","14/15","13/14",null,"2015-10-19","15/16","14/15","13/14"]
[null,null,null,null,null,null,null,"2015-10-20","15/16","14/15","13/14",null,"2015-10-20","15/16","14/15","13/14"]
[null,null,null,null,null,null,null,"2015-10-21","15/16","14/15","13/14",null,"2015-10-21","15/16","14/15","13/14"]
[null,null,null,null,null,null,null,"2015-10-22","15/16","14/15","13/14",null,"2015-10-22","15/16","14/15","13/14"]
[null,null,null,null,null,null,null,"2015-10-23","15/16","14/15","13/14",null,"2015-10-23","15/16","14/15","13/14"]
[null,null,null,null,null,null,null,"2015-10-24","15/16","14/15","13/14",null,"2015-10-24","15/16","14/15","13/14"]
[null,null,null,null,null,null,null,"2015-10-25","15/16","14/15","13/14",null,"2015-10-25","15/16","14/15","13/14"]
[null,null,null,null,null,null,null,"2015-10-26","15/16","14/15","13/14",null,"2015-10-26","15/16","14/15","13/14"]
[null,null,null,null,null,null,null,"2015-10-27","15/16","14/15","13/14",null,"2015-10-27","15/16","14/15","13/14"]
[null,null,null,null,null,null,null,"2015-10-28","15/16","14/15","13/14",null,"2015-10-28","15/16","14/15","13/14"]
[null,null,null,null,null,null,null,"2015-10-29","15/16","14/15","13/14",null,"2015-10-29","15/16","14/15","13/14"]
[null,null,null,null,null,null,null,"2015-10-30","15/16","14/15","13/14",null,"2015-10-30","15/16","14/15","13/14"]
[null,null,null,null,null,null,null,"2015-10-31","15/16","14/15","13/14",null,"2015-10-31","15/16","14/15","13/14"]
[null,null,null,null,null,null,null,"2015-11-01","15/16","14/15","13/14",null,"2015-11-01","15/16","14/15","13/14"]
[null,null,null,null,null,null,null,"2015-11-02","15/16","14/15","13/14",null,"2015-11-02","15/16","14/15","13/14"]
[null,null,null,null,null,null,null,"2015-11-03","15/16","14/15","13/14",null,"2015-11-03","15/16","14/15","13/14"]
[null,null,null,null,null,null,null,"2015-11-04","15/16","14/15","13/14",null,"2015-11-04","15/16","14/15","13/14"]
[null,null,null,null,null,null,null,"2015-11-05","15/16","14/15","13/14",null,"2015-11-05","15/16","14/15","13/14"]
[null,null,null,null,null,null,null,"2015-11-06","15/16","14/15","13/14",null,"2015-11-06","15/16","14/15","13/14"]
[null,null,null,null,null,null,null,"2015-11-07","15/16","14/15","13/14",null,"2015-11-07","15/16","14/15","13/14"]
[null,null,null,null,null,null,null,"2015-11-08","15/16","14/15","13/14",null,"2015-11-08","15/16","14/15","13/14"]
[null,null,null,null,null,null,null,"2015-11-09","15/16","14/15","13/14",null,"2015-11-09","15/16","14/15","13/14"]
[null,null,null,null,null,null,null,"2015-11-10","15/16","14/15","13/14",null,"2015-11-10","15/16","14/15","13/14"]
[null,null,null,null,null,null,null,"2015-11-11","15/16","14/15","13/14",null,"2015-11-11","15/16","14/15","13/14"]
[null,null,null,null,null,null,null,"2015-11-12","15/16","14/15","13/14",null,"2015-11-12","15/16","14/15","13/14"]
[null,null,null,null,null,null,null,"2015-11-13","15/16","14/15","13/14",null,"2015-11-13","15/16","14/15","13/14"]
[null,null,null,null,null,null,null,"2015-11-14","15/16","14/15","13/14",null,"2015-11-14","15/16","14/15","13/14"]
[null,null,null,null,null,null,null,"2015-11-15","15/16","14/15","13/14",null,"2015-11-15","15/16","14/15","13/14"]
[null,null,null,null,null,null,null,"2015-11-16","15/16","14/15","13/14",null,"2015-11-16","15/16","14/15","13/14"]
[null,null,null,null,null,null,null,"2015-11-17","15/16","14/15","13/14",null,"2015-11-17","15/16","14/15","13/14"]
[null,null,null,null,null,null,null,"2015-11-18","15/16","14/15","13/14",null,"2015-11-18","15/16","14/15","13/14"]
[null,null,null,null,null,null,null,"2015-11-19","15/16","14/15","13/14",null,"2015-11-19","15/16","14/15","13/14"]
[null,null,null,null,null,null,null,"2015-11-20","15/16","14/15","13/14",null,"2015-11-20","15/16","14/15","13/14"]
[null,null,null,null,null,null,null,"2015-11-21","15/16","14/15","13/14",null,"2015-11-21","15/16","14/15","13/14"]
[null,null,null,null,null,null,null,"2015-11-22","15/16","14/15","13/14",null,"2015-11-22","15/16","14/15","13/14"]
[null,null,null,null,null,null,null,"2015-11-23","15/16","14/15","13/14",null,"2015-11-23","15/16","14/15","13/14"]
[null,null,null,null,null,null,null,"2015-11-24","15/16","14/15","13/14",null,"2015-11-24","15/16","14/15","13/14"]
[null,null,null,null,null,null,null,"2015-11-25","15/16","14/15","13/14",null,"2015-11-25","15/16","14/15","13/14"]
[null,null,null,null,null,null,null,"2015-11-26","15/16","14/15","13/14",null,"2015-11-26","15/16","14/15","13/14"]
[null,null,null,null,null,null,null,"2015-11-27","15/16","14/15","13/14",null,"2015-11-27","15/16","14/15","13/14"]
[null,null,null,null,null,null,null,"2015-11-28","15/16","14/15","13/14",null,"2015-11-28","15/16","14/15","13/14"]
[null,null,null,null,null,null,null,"2015-11-29","15/16","14/15","13/14",null,"2015-11-29","15/16","14/15","13/14"]
[null,null,null,null,null,null,null,"2015-11-30","15/16","14/15","13/14",null,"2015-11-30","15/16","14/15","13/14"]
[null,null,null,null,null,null,null,"2015-12-01","15/16","14/15","13/14",null,"2015-12-01","15/16","14/15","13/14"]
[null,null,null,null,null,null,null,"2015-12-02","15/16","14/15","13/14",null,"2015-12-02","15/16","14/15","13/14"]
[null,null,null,null,null,null,null,"2015-12-03","15/16","14/15","13/14",null,"2015-12-03","15/16","14/15","13/14"]
[null,null,null,null,null,null,null,"2015-12-04","15/16","14/15","13/14",null,"2015-12-04","15/16","14/15","13/14"]
[null,null,null,null,null,null,null,"2015-12-05","15/16","14/15","13/14",null,"2015-12-05","15/16","14/15","13/14"]
[null,null,null,null,null,null,null,"2015-12-06","15/16","14/15","13/14",null,"2015-12-06","15/16","14/15","13/14"]
[null,null,null,null,null,null,null,"2015-12-07","15/16","14/15","13/14",null,"2015-12-07","15/16","14/15","13/14"]
[null,null,null,null,null,null,null,"2015-12-08","15/16","14/15","13/14",null,"2015-12-08","15/16","14/15","13/14"]
[null,null,null,null,null,null,null,"2015-12-09","15/16","14/15","13/14",null,"2015-12-09","15/16","14/15","13/14"]
[null,null,null,null,null,null,null,"2015-12-10","15/16","14/15","13/14",null,"2015-12-10","15/16","14/15","13/14"]
[null,null,null,null,null,null,null,"2015-12-11","15/16","14/15","13/14",null,"2015-12-11","15/16","14/15","13/14"]
[null,null,null,null,null,null,null,"2015-12-12","15/16","14/15","13/14",null,"2015-12-12","15/16","14/15","13/14"]
[null,null,null,null,null,null,null,"2015-12-13","15/16","14/15","13/14",null,"2015-12-13","15/16","14/15","13/14"]
[null,null,null,null,null,null,null,"2015-12-14","15/16","14/15","13/14",null,"2015-12-14","15/16","14/15","13/14"]
[null,null,null,null,null,null,null,"2015-12-15","15/16","14/15","13/14",null,"2015-12-15","15/16","14/15","13/14"]
[null,null,null,null,null,null,null,"2015-12-16","15/16","14/15","13/14",null,"2015-12-16","15/16","14/15","13/14"]
[null,null,null,null,null,null,null,"2015-12-17","15/16","14/15","13/14",null,"2015-12-17","15/16","14/15","13/14"]
[null,null,null,null,null,null,null,"2015-12-18","15/16","14/15","13/14",null,"2015-12-18","15/16","14/15","13/14"]
[null,null,null,null,null,null,null,"2015-12-19","15/16","14/15","13/14",null,"2015-12-19","15/16","14/15","13/14"]
[null,null,null,null,null,null,null,"2015-12-20","15/16","14/15","13/14",null,"2015-12-20","15/16","14/15","13/14"]
[null,null,null,null,null,null,null,"2015-12-21","15/16","14/15","13/14",null,"2015-12-21","15/16","14/15","13/14"]
[null,null,null,null,null,null,null,"2015-12-22","15/16","14/15","13/14",null,"2015-12-22","15/16","14/15","13/14"]
[null,null,null,null,null,null,null,"2015-12-23","15/16","14/15","13/14",null,"2015-12-23","15/16","14/15","13/14"]
[null,null,null,null,null,null,null,"2015-12-24","15/16","14/15","13/14",null,"2015-12-24","15/16","14/15","13/14"]
[null,null,null,null,null,null,null,"2015-12-25","15/16","14/15","13/14",null,"2015-12-25","15/16","14/15","13/14"]
[null,null,null,null,null,null,null,"2015-12-26","15/16","14/15","13/14",null,"2015-12-26","15/16","14/15","13/14"]
[null,null,null,null,null,null,null,"2015-12-27","15/16","14/15","13/14",null,"2015-12-27","15/16","14/15","13/14"]
[null,null,null,null,null,null,null,"2015-12-28","15/16","14/15","13/14",null,"2015-12-28","15/16","14/15","13/14"]
[null,null,null,null,null,null,null,"2015-12-29","15/16","14/15","13/14",null,"2015-12-29","15/16","14/15","13/14"]
[null,null,null,null,null,null,null,"2015-12-30","15/16","14/15","13/14",null,"2015-12-30","15/16","14/15","13/14"]
[null,null,null,null,null,null,null,"2015-12-31","15/16","14/15","13/14",null,"2015-12-31","15/16","14/15","13/14"]
[null,null,null,null,null,null,null,"2016-01-01","15/16","14/15","13/14",null,"2016-01-01","15/16","14/15","13/14"]
[null,null,null,null,null,null,null,"2016-01-02","15/16","14/15","13/14",null,"2016-01-02","15/16","14/15","13/14"]
[null,null,null,null,null,null,null,"2016-01-03","15/16","14/15","13/14",null,"2016-01-03","15/16","14/15","13/14"]
[null,null,null,null,null,null,null,"2016-01-04","15/16","14/15","13/14",null,"2016-01-04","15/16","14/15","13/14"]
[null,null,null,null,null,null,null,"2016-01-05","15/16","14/15","13/14",null,"2016-01-05","15/16","14/15","13/14"]
[null,null,null,null,null,null,null,"2016-01-06","15/16","14/15","13/14",null,"2016-01-06","15/16","14/15","13/14"]
[null,null,null,null,null,null,null,"2016-01-07","15/16","14/15","13/14",null,"2016-01-07","15/16","14/15","13/14"]
[null,null,null,null,null,null,null,"2016-01-08","15/16","14/15","13/14",null,"2016-01-08","15/16","14/15","13/14"]
[null,null,null,null,null,null,null,"2016-01-09","15/16","14/15","13/14",null,"2016-01-09","15/16","14/15","13/14"]
[null,null,null,null,null,null,null,"2016-01-10","15/16","14/15","13/14",null,"2016-01-10","15/16","14/15","13/14"]
[null,null,null,null,null,null,null,"2016-01-11","15/16","14/15","13/14",null,"2016-01-11","15/16","14/15","13/14"]
[null,null,null,null,null,null,null,"2016-01-12","15/16","14/15","13/14",null,"2016-01-12","15/16","14/15","13/14"]
[null,null,null,null,null,null,null,"2016-01-13","15/16","14/15","13/14",null,"2016-01-13","15/16","14/15","13/14"]
[null,null,null,null,null,null,null,"2016-01-14","15/16","14/15","13/14",null,"2016-01-14","15/16","14/15","13/14"]
[null,null,null,null,null,null,null,"2016-01-15","15/16","14/15","13/14",null,"2016-01-15","15/16","14/15","13/14"]
[null,null,null,null,null,null,null,"2016-01-16","15/16","14/15","13/14",null,"2016-01-16","15/16","14/15","13/14"]
[null,null,null,null,null,null,null,"2016-01-17","15/16","14/15","13/14",null,"2016-01-17","15/16","14/15","13/14"]
[null,null,null,null,null,null,null,"2016-01-18","15/16","14/15","13/14",null,"2016-01-18","15/16","14/15","13/14"]
[null,null,null,null,null,null,null,"2016-01-19","15/16","14/15","13/14",null,"2016-01-19","15/16","14/15","13/14"]
[null,null,null,null,null,null,null,"2016-01-20","15/16","14/15","13/14",null,"2016-01-20","15/16","14/15","13/14"]
[null,null,null,null,null,null,null,"2016-01-21","15/16","14/15","13/14",null,"2016-01-21","15/16","14/15","13/14"]
[null,null,null,null,null,null,null,"2016-01-22","15/16","14/15","13/14",null,"2016-01-22","15/16","14/15","13/14"]
[null,null,null,null,null,null,null,"2016-01-23","15/16","14/15","13/14",null,"2016-01-23","15/16","14/15","13/14"]
[null,null,null,null,null,null,null,"2016-01-24","15/16","14/15","13/14",null,"2016-01-24","15/16","14/15","13/14"]
[null,null,null,null,null,null,null,"2016-01-25","15/16","14/15","13/14",null,"2016-01-25","15/16","14/15","13/14"]
[null,null,null,null,null,null,null,"2016-01-26","15/16","14/15","13/14",null,"2016-01-26","15/16","14/15","13/14"]
[null,null,null,null,null,null,null,"2016-01-27","15/16","14/15","13/14",null,"2016-01-27","15/16","14/15","13/14"]
[null,null,null,null,null,null,null,"2016-01-28","15/16","14/15","13/14",null,"2016-01-28","15/16","14/15","13/14"]
[null,null,null,null,null,null,null,"2016-01-29","15/16","14/15","13/14",null,"2016-01-29","15/16","14/15","13/14"]
[null,null,null,null,null,null,null,"2016-01-30","15/16","14/15","13/14",null,"2016-01-30","15/16","14/15","13/14"]
[null,null,null,null,null,null,null,"2016-01-31","15/16","14/15","13/14",null,"2016-01-31","15/16","14/15","13/14"]
[null,null,null,null,null,null,null,"2016-02-01","15/16","14/15","13/14",null,"2016-02-01","15/16","14/15","13/14"]
[null,null,null,null,null,null,null,"2016-02-02","15/16","14/15","13/14",null,"2016-02-02","15/16","14/15","13/14"]
[null,null,null,null,null,null,null,"2016-02-03","15/16","14/15","13/14",null,"2016-02-03","15/16","14/15","13/14"]
[null,null,null,null,null,null,null,"2016-02-04","15/16","14/15","13/14",null,"2016-02-04","15/16","14/15","13/14"]
[null,null,null,null,null,null,null,"2016-02-05","15/16","14/15","13/14",null,"2016-02-05","15/16","14/15","13/14"]
[null,null,null,null,null,null,null,"2016-02-06","15/16","14/15","13/14",null,"2016-02-06","15/16","14/15","13/14"]
[null,null,null,null,null,null,null,"2016-02-07","15/16","14/15","13/14",null,"2016-02-07","15/16","14/15","13/14"]
[null,null,null,null,null,null,null,"2016-02-08","15/16","14/15","13/14",null,"2016-02-08","15/16","14/15","13/14"]
[null,null,null,null,null,null,null,"2016-02-09","15/16","14/15","13/14",null,"2016-02-09","15/16","14/15","13/14"]
[null,null,null,null,null,null,null,"2016-02-10","15/16","14/15","13/14",null,"2016-02-10","15/16","14/15","13/14"]
[null,null,null,null,null,null,null,"2016-02-11","15/16","14/15","13/14",null,"2016-02-11","15/16","14/15","13/14"]
[null,null,null,null,null,null,null,"2016-02-12","15/16","14/15","13/14",null,"2016-02-12","15/16","14/15","13/14"]
[null,null,null,null,null,null,null,"2016-02-13","15/16","14/15","13/14",null,"2016-02-13","15/16","14/15","13/14"]
[null,null,null,null,null,null,null,"2016-02-14","15/16","14/15","13/14",null,"2016-02-14","15/16","14/15","13/14"]
[null,null,null,null,null,null,null,"2016-02-15","15/16","14/15","13/14",null,"2016-02-15","15/16","14/15","13/14"]
[null,null,null,null,null,null,null,"2016-02-16","15/16","14/15","13/14",null,"2016-02-16","15/16","14/15","13/14"]
[null,null,null,null,null,null,null,"2016-02-17","15/16","14/15","13/14",null,"2016-02-17","15/16","14/15","13/14"]
[null,null,null,null,null,null,null,"2016-02-18","15/16","14/15","13/14",null,"2016-02-18","15/16","14/15","13/14"]
[null,null,null,null,null,null,null,"2016-02-19","15/16","14/15","13/14",null,"2016-02-19","15/16","14/15","13/14"]
[null,null,null,null,null,null,null,"2016-02-20","15/16","14/15","13/14",null,"2016-02-20","15/16","14/15","13/14"]
[null,null,null,null,null,null,null,"2016-02-21","15/16","14/15","13/14",null,"2016-02-21","15/16","14/15","13/14"]
[null,null,null,null,null,null,null,"2016-02-22","15/16","14/15","13/14",null,"2016-02-22","15/16","14/15","13/14"]
[null,null,null,null,null,null,null,"2016-02-23","15/16","14/15","13/14",null,"2016-02-23","15/16","14/15","13/14"]
[null,null,null,null,null,null,null,"2016-02-24","15/16","14/15","13/14",null,"2016-02-24","15/16","14/15","13/14"]
[null,null,null,null,null,null,null,"2016-02-25","15/16","14/15","13/14",null,"2016-02-25","15/16","14/15","13/14"]
[null,null,null,null,null,null,null,"2016-02-26","15/16","14/15","13/14",null,"2016-02-26","15/16","14/15","13/14"]
[null,null,null,null,null,null,null,"2016-02-27","15/16","14/15","13/14",null,"2016-02-27","15/16","14/15","13/14"]
[null,null,null,null,null,null,null,"2016-02-28","15/16","14/15","13/14",null,"2016-02-28","15/16","14/15","13/14"]
[null,null,null,null,null,null,null,"2016-02-29","15/16","14/15","13/14",null,"2016-02-29","15/16","14/15","13/14"]
[null,null,null,null,null,null,null,"2016-03-01","15/16","14/15","13/14",null,"2016-03-01","15/16","14/15","13/14"]
[null,null,null,null,null,null,null,"2016-03-02","15/16","14/15","13/14",null,"2016-03-02","15/16","14/15","13/14"]
[null,null,null,null,null,null,null,"2016-03-03","15/16","14/15","13/14",null,"2016-03-03","15/16","14/15","13/14"]
[null,null,null,null,null,null,null,"2016-03-04","15/16","14/15","13/14",null,"2016-03-04","15/16","14/15","13/14"]
[null,null,null,null,null,null,null,"2016-03-05","15/16","14/15","13/14",null,"2016-03-05","15/16","14/15","13/14"]
[null,null,null,null,null,null,null,"2016-03-06","15/16","14/15","13/14",null,"2016-03-06","15/16","14/15","13/14"]
[null,null,null,null,null,null,null,"2016-03-07","15/16","14/15","13/14",null,"2016-03-07","15/16","14/15","13/14"]
[null,null,null,null,null,null,null,"2016-03-08","15/16","14/15","13/14",null,"2016-03-08","15/16","14/15","13/14"]
[null,null,null,null,null,null,null,"2016-03-09","15/16","14/15","13/14",null,"2016-03-09","15/16","14/15","13/14"]
[null,null,null,null,null,null,null,"2016-03-10","15/16","14/15","13/14",null,"2016-03-10","15/16","14/15","13/14"]
[null,null,null,null,null,null,null,"2016-03-11","15/16","14/15","13/14",null,"2016-03-11","15/16","14/15","13/14"]
[null,null,null,null,null,null,null,"2016-03-12","15/16","14/15","13/14",null,"2016-03-12","15/16","14/15","13/14"]
[null,null,null,null,null,null,null,"2016-03-13","15/16","14/15","13/14",null,"2016-03-13","15/16","14/15","13/14"]
[null,null,null,null,null,null,null,"2016-03-14","15/16","14/15","13/14",null,"2016-03-14","15/16","14/15","13/14"]
[null,null,null,null,null,null,null,"2016-03-15","15/16","14/15","13/14",null,"2016-03-15","15/16","14/15","13/14"]
[null,null,null,null,null,null,null,"2016-03-16","15/16","14/15","13/14",null,"2016-03-16","15/16","14/15","13/14"]
[null,null,null,null,null,null,null,"2016-03-17","15/16","14/15","13/14",null,"2016-03-17","15/16","14/15","13/14"]
[null,null,null,null,null,null,null,"2016-03-18","15/16","14/15","13/14",null,"2016-03-18","15/16","14/15","13/14"]
[null,null,null,null,null,null,null,"2016-03-19","15/16","14/15","13/14",null,"2016-03-19","15/16","14/15","13/14"]
[null,null,null,null,null,null,null,"2016-03-20","15/16","14/15","13/14",null,"2016-03-20","15/16","14/15","13/14"]
[null,null,null,null,null,null,null,"2016-03-21","15/16","14/15","13/14",null,"2016-03-21","15/16","14/15","13/14"]
[null,null,null,null,null,null,null,"2016-03-22","15/16","14/15","13/14",null,"2016-03-22","15/16","14/15","13/14"]
[null,null,null,null,null,null,null,"2016-03-23","15/16","14/15","13/14",null,"2016-03-23","15/16","14/15","13/14"]
[null,null,null,null,null,null,null,"2016-03-24","15/16","14/15","13/14",null,"2016-03-24","15/16","14/15","13/14"]
[null,null,null,null,null,null,null,"2016-03-25","15/16","14/15","13/14",null,"2016-03-25","15/16","14/15","13/14"]
[null,null,null,null,null,null,null,"2016-03-26","15/16","14/15","13/14",null,"2016-03-26","15/16","14/15","13/14"]
[null,null,null,null,null,null,null,"2016-03-27","15/16","14/15","13/14",null,"2016-03-27","15/16","14/15","13/14"]
[null,null,null,null,null,null,null,"2016-03-28","15/16","14/15","13/14",null,"2016-03-28","15/16","14/15","13/14"]
[null,null,null,null,null,null,null,"2016-03-29","15/16","14/15","13/14",null,"2016-03-29","15/16","14/15","13/14"]
[null,null,null,null,null,null,null,"2016-03-30","15/16","14/15","13/14",null,"2016-03-30","15/16","14/15","13/14"]
[null,null,null,null,null,null,null,"2016-03-31","15/16","14/15","13/14",null,"2016-03-31","15/16","14/15","13/14"]
[null,null,null,null,null,null,null,"2016-04-01","15/16","14/15","13/14",null,"2016-04-01","15/16","14/15","13/14"]
[null,null,null,null,null,null,null,"2016-04-02","15/16","14/15","13/14",null,"2016-04-02","15/16","14/15","13/14"]
[null,null,null,null,null,null,null,"2016-04-03","15/16","14/15","13/14",null,"2016-04-03","15/16","14/15","13/14"]
[null,null,null,null,null,null,null,"2016-04-04","15/16","14/15","13/14",null,"2016-04-04","15/16","14/15","13/14"]
[null,null,null,null,null,null,null,"2016-04-05","15/16","15/16","14/15",null,"2016-04-05","15/16","15/16","14/15"]
[null,null,null,null,null,null,null,"2016-04-06","16/17","15/16","14/15",null,"2016-04-06","N/A","15/16","14/15"]
[null,null,null,null,null,null,null,"2016-04-07","16/17","15/16","14/15",null,"2016-04-07","N/A","15/16","14/15"]
[null,null,null,null,null,null,null,"2016-04-08","16/17","15/16","14/15",null,"2016-04-08","N/A","15/16","14/15"]
[null,null,null,null,null,null,null,"2016-04-09","16/17","15/16","14/15",null,"2016-04-09","N/A","15/16","14/15"]
[null,null,null,null,null,null,null,"2016-04-10","16/17","15/16","14/15",null,"2016-04-10","N/A","15/16","14/15"]
[null,null,null,null,null,null,null,"2016-04-11","16/17","15/16","14/15",null,"2016-04-11","N/A","15/16","14/15"]
[null,null,null,null,null,null,null,"2016-04-12","16/17","15/16","14/15",null,"2016-04-12","N/A","15/16","14/15"]
[null,null,null,null,null,null,null,"2016-04-13","16/17","15/16","14/15",null,"2016-04-13","N/A","15/16","14/15"]
[null,null,null,null,null,null,null,"2016-04-14","16/17","15/16","14/15",null,"2016-04-14","N/A","15/16","14/15"]
[null,null,null,null,null,null,null,"2016-04-15","16/17","15/16","14/15",null,"2016-04-15","N/A","15/16","14/15"]
[null,null,null,null,null,null,null,"2016-04-16","16/17","15/16","14/15",null,"2016-04-16","N/A","15/16","14/15"]
[null,null,null,null,null,null,null,"2016-04-17","16/17","15/16","14/15",null,"2016-04-17","N/A","15/16","14/15"]
[null,null,null,null,null,null,null,"2016-04-18","16/17","15/16","14/15",null,"2016-04-18","N/A","15/16","14/15"]
[null,null,null,null,null,null,null,"2016-04-19","16/17","15/16","14/15",null,"2016-04-19","N/A","15/16","14/15"]
[null,null,null,null,null,null,null,"2016-04-20","16/17","15/16","14/15",null,"2016-04-20","N/A","15/16","14/15"]
[null,null,null,null,null,null,null,"2016-04-21","16/17","15/16","14/15",null,"2016-04-21","N/A","15/16","14/15"]
[null,null,null,null,null,null,null,"2016-04-22","16/17","15/16","14/15",null,"2016-04-22","N/A","15/16","14/15"]
[null,null,null,null,null,null,null,"2016-04-23","16/17","15/16","14/15",null,"2016-04-23","N/A","15/16","14/15"]
[null,null,null,null,null,null,null,"2016-04-24","16/17","15/16","14/15",null,"2016-04-24","N/A","15/16","14/15"]
[null,null,null,null,null,null,null,"2016-04-25","16/17","15/16","14/15",null,"2016-04-25","N/A","15/16","14/15"]
[null,null,null,null,null,null,null,"2016-04-26","16/17","15/16","14/15",null,"2016-04-26","N/A","15/16","14/15"]
[null,null,null,null,null,null,null,"2016-04-27","16/17","15/16","14/15",null,"2016-04-27","N/A","15/16","14/15"]
[null,null,null,null,null,null,null,"2016-04-28","16/17","15/16","14/15",null,"2016-04-28","N/A","15/16","14/15"]
[null,null,null,null,null,null,null,"2016-04-29","16/17","15/16","14/15",null,"2016-04-29","N/A","15/16","14/15"]
[null,null,null,null,null,null,null,"2016-04-30","16/17","15/16","14/15",null,"2016-04-30","N/A","15/16","14/15"]
[null,null,null,null,null,null,null,"2016-05-01","16/17","15/16","14/15",null,"2016-05-01","N/A","15/16","14/15"]
[null,null,null,null,null,null,null,"2016-05-02","16/17","15/16","14/15",null,"2016-05-02","N/A","15/16","14/15"]
[null,null,null,null,null,null,null,"2016-05-03","16/17","15/16","14/15",null,"2016-05-03","N/A","15/16","14/15"]
[null,null,null,null,null,null,null,"2016-05-04","16/17","15/16","14/15",null,"2016-05-04","N/A","15/16","14/15"]
[null,null,null,null,null,null,null,"2016-05-05","16/17","15/16","14/15",null,"2016-05-05","N/A","15/16","14/15"]
[null,null,null,null,null,null,null,"2016-05-06","16/17","15/16","14/15",null,"2016-05-06","N/A","15/16","14/15"]
[null,null,null,null,null,null,null,"2016-05-07","16/17","15/16","14/15",null,"2016-05-07","N/A","15/16","14/15"]
[null,null,null,null,null,null,null,"2016-05-08","16/17","15/16","14/15",null,"2016-05-08","N/A","15/16","14/15"]
[null,null,null,null,null,null,null,"2016-05-09","16/17","15/16","14/15",null,"2016-05-09","N/A","15/16","14/15"]
[null,null,null,null,null,null,null,"2016-05-10","16/17","15/16","14/15",null,"2016-05-10","N/A","15/16","14/15"]
[null,null,null,null,null,null,null,"2016-05-11","16/17","15/16","14/15",null,"2016-05-11","N/A","15/16","14/15"]
[null,null,null,null,null,null,null,"2016-05-12","16/17","15/16","14/15",null,"2016-05-12","N/A","15/16","14/15"]
[null,null,null,null,null,null,null,"2016-05-13","16/17","15/16","14/15",null,"2016-05-13","N/A","15/16","14/15"]
[null,null,null,null,null,null,null,"2016-05-14","16/17","15/16","14/15",null,"2016-05-14","N/A","15/16","14/15"]
[null,null,null,null,null,null,null,"2016-05-15","16/17","15/16","14/15",null,"2016-05-15","N/A","15/16","14/15"]
[null,null,null,null,null,null,null,"2016-05-16","16/17","15/16","14/15",null,"2016-05-16","N/A","15/16","14/15"]
[null,null,null,null,null,null,null,"2016-05-17","16/17","15/16","14/15",null,"2016-05-17","N/A","15/16","14/15"]
[null,null,null,null,null,null,null,"2016-05-18","16/17","15/16","14/15",null,"2016-05-18","N/A","15/16","14/15"]
[null,null,null,null,null,null,null,"2016-05-19","16/17","15/16","14/15",null,"2016-05-19","N/A","15/16","14/15"]
[null,null,null,null,null,null,null,"2016-05-20","16/17","15/16","14/15",null,"2016-05-20","N/A","15/16","14/15"]
[null,null,null,null,null,null,null,"2016-05-21","16/17","15/16","14/15",null,"2016-05-21","N/A","15/16","14/15"]
[null,null,null,null,null,null,null,"2016-05-22","16/17","15/16","14/15",null,"2016-05-22","N/A","15/16","14/15"]
[null,null,null,null,null,null,null,"2016-05-23","16/17","15/16","14/15",null,"2016-05-23","N/A","15/16","14/15"]
[null,null,null,null,null,null,null,"2016-05-24","16/17","15/16","14/15",null,"2016-05-24","N/A","15/16","14/15"]
[null,null,null,null,null,null,null,"2016-05-25","16/17","15/16","14/15",null,"2016-05-25","N/A","15/16","14/15"]
[null,null,null,null,null,null,null,"2016-05-26","16/17","15/16","14/15",null,"2016-05-26","N/A","15/16","14/15"]
[null,null,null,null,null,null,null,"2016-05-27","16/17","15/16","14/15",null,"2016-05-27","N/A","15/16","14/15"]
[null,null,null,null,null,null,null,"2016-05-28","16/17","15/16","14/15",null,"2016-05-28","N/A","15/16","14/15"]
[null,null,null,null,null,null,null,"2016-05-29","16/17","15/16","14/15",null,"2016-05-29","N/A","15/16","14/15"]
[null,null,null,null,null,null,null,"2016-05-30","16/17","15/16","14/15",null,"2016-05-30","N/A","15/16","14/15"]
[null,null,null,null,null,null,null,"2016-05-31","16/17","15/16","14/15",null,"2016-05-31","N/A","15/16","14/15"]
[null,null,null,null,null,null,null,"2016-06-01","16/17","15/16","14/15",null,"2016-06-01","N/A","15/16","14/15"]
[null,null,null,null,null,null,null,"2016-06-02","16/17","15/16","14/15",null,"2016-06-02","N/A","15/16","14/15"]
[null,null,null,null,null,null,null,"2016-06-03","16/17","15/16","14/15",null,"2016-06-03","N/A","15/16","14/15"]
[null,null,null,null,null,null,null,"2016-06-04","16/17","15/16","14/15",null,"2016-06-04","N/A","15/16","14/15"]
[null,null,null,null,null,null,null,"2016-06-05","16/17","15/16","14/15",null,"2016-06-05","N/A","15/16","14/15"]
[null,null,null,null,null,null,null,"2016-06-06","16/17","15/16","14/15",null,"2016-06-06","N/A","15/16","14/15"]
[null,null,null,null,null,null,null,"2016-06-07","16/17","15/16","14/15",null,"2016-06-07","N/A","15/16","14/15"]
[null,null,null,null,null,null,null,"2016-06-08","16/17","15/16","14/15",null,"2016-06-08","N/A","15/16","14/15"]
[null,null,null,null,null,null,null,"2016-06-09","16/17","15/16","14/15",null,"2016-06-09","N/A","15/16","14/15"]
[null,null,null,null,null,null,null,"2016-06-10","16/17","15/16","14/15",null,"2016-06-10","N/A","15/16","14/15"]
[null,null,null,null,null,null,null,"2016-06-11","16/17","15/16","14/15",null,"2016-06-11","N/A","15/16","14/15"]
[null,null,null,null,null,null,null,"2016-06-12","16/17","15/16","14/15",null,"2016-06-12","N/A","15/16","14/15"]
[null,null,null,null,null,null,null,"2016-06-13","16/17","15/16","14/15",null,"2016-06-13","N/A","15/16","14/15"]
[null,null,null,null,null,null,null,"2016-06-14","16/17","15/16","14/15",null,"2016-06-14","N/A","15/16","14/15"]
[null,null,null,null,null,null,null,"2016-06-15","16/17","15/16","14/15",null,"2016-06-15","N/A","15/16","14/15"]
[null,null,null,null,null,null,null,"2016-06-16","16/17","15/16","14/15",null,"2016-06-16","N/A","15/16","14/15"]
[null,null,null,null,null,null,null,"2016-06-17","16/17","15/16","14/15",null,"2016-06-17","N/A","15/16","14/15"]
[null,null,null,null,null,null,null,"2016-06-18","16/17","15/16","14/15",null,"2016-06-18","N/A","15/16","14/15"]
[null,null,null,null,null,null,null,"2016-06-19","16/17","15/16","14/15",null,"2016-06-19","N/A","15/16","14/15"]
[null,null,null,null,null,null,null,"2016-06-20","16/17","15/16","14/15",null,"2016-06-20","N/A","15/16","14/15"]
[null,null,null,null,null,null,null,"2016-06-21","16/17","15/16","14/15",null,"2016-06-21","N/A","15/16","14/15"]
[null,null,null,null,null,null,null,"2016-06-22","16/17","15/16","14/15",null,"2016-06-22","N/A","15/16","14/15"]
[null,null,null,null,null,null,null,"2016-06-23","16/17","15/16","14/15",null,"2016-06-23","N/A","15/16","14/15"]
[null,null,null,null,null,null,null,"2016-06-24","16/17","15/16","14/15",null,"2016-06-24","N/A","15/16","14/15"]
[null,null,null,null,null,null,null,"2016-06-25","16/17","15/16","14/15",null,"2016-06-25","N/A","15/16","14/15"]
[null,null,null,null,null,null,null,"2016-06-26","16/17","15/16","14/15",null,"2016-06-26","N/A","15/16","14/15"]
[null,null,null,null,null,null,null,"2016-06-27","16/17","15/16","14/15",null,"2016-06-27","N/A","15/16","14/15"]
[null,null,null,null,null,null,null,"2016-06-28","16/17","15/16","14/15",null,"2016-06-28","N/A","15/16","14/15"]
[null,null,null,null,null,null,null,"2016-06-29","16/17","15/16","14/15",null,"2016-06-29","N/A","15/16","14/15"]
[null,null,null,null,null,null,null,"2016-06-30","16/17","15/16","14/15",null,"2016-06-30","N/A","15/16","14/15"]
[null,null,null,null,null,null,null,"2016-07-01","16/17","15/16","14/15",null,"2016-07-01","N/A","15/16","14/15"]
[null,null,null,null,null,null,null,"2016-07-02","16/17","15/16","14/15",null,"2016-07-02","N/A","15/16","14/15"]
[null,null,null,null,null,null,null,"2016-07-03","16/17","15/16","14/15",null,"2016-07-03","N/A","15/16","14/15"]
[null,null,null,null,null,null,null,"2016-07-04","16/17","15/16","14/15",null,"2016-07-04","N/A","15/16","14/15"]
[null,null,null,null,null,null,null,"2016-07-05","16/17","15/16","14/15",null,"2016-07-05","N/A","15/16","14/15"]
[null,null,null,null,null,null,null,"2016-07-06","16/17","15/16","14/15",null,"2016-07-06","N/A","15/16","14/15"]
[null,null,null,null,null,null,null,"2016-07-07","16/17","15/16","14/15",null,"2016-07-07","N/A","15/16","14/15"]
[null,null,null,null,null,null,null,"2016-07-08","16/17","15/16","14/15",null,"2016-07-08","N/A","15/16","14/15"]
[null,null,null,null,null,null,null,"2016-07-09","16/17","15/16","14/15",null,"2016-07-09","N/A","15/16","14/15"]
[null,null,null,null,null,null,null,"2016-07-10","16/17","15/16","14/15",null,"2016-07-10","N/A","15/16","14/15"]
[null,null,null,null,null,null,null,"2016-07-11","16/17","15/16","14/15",null,"2016-07-11","N/A","15/16","14/15"]
[null,null,null,null,null,null,null,"2016-07-12","16/17","15/16","14/15",null,"2016-07-12","N/A","15/16","14/15"]
[null,null,null,null,null,null,null,"2016-07-13","16/17","15/16","14/15",null,"2016-07-13","N/A","15/16","14/15"]
[null,null,null,null,null,null,null,"2016-07-14","16/17","15/16","14/15",null,"2016-07-14","N/A","15/16","14/15"]
[null,null,null,null,null,null,null,"2016-07-15","16/17","15/16","14/15",null,"2016-07-15","N/A","15/16","14/15"]
[null,null,null,null,null,null,null,"2016-07-16","16/17","15/16","14/15",null,"2016-07-16","N/A","15/16","14/15"]
[null,null,null,null,null,null,null,"2016-07-17","16/17","15/16","14/15",null,"2016-07-17","N/A","15/16","14/15"]
[null,null,null,null,null,null,null,"2016-07-18","16/17","15/16","14/15",null,"2016-07-18","N/A","15/16","14/15"]
[null,null,null,null,null,null,null,"2016-07-19","16/17","15/16","14/15",null,"2016-07-19","N/A","15/16","14/15"]
[null,null,null,null,null,null,null,"2016-07-20","16/17","15/16","14/15",null,"2016-07-20","N/A","15/16","14/15"]
[null,null,null,null,null,null,null,"2016-07-21","16/17","15/16","14/15",null,"2016-07-21","N/A","15/16","14/15"]
[null,null,null,null,null,null,null,"2016-07-22","16/17","15/16","14/15",null,"2016-07-22","N/A","15/16","14/15"]
[null,null,null,null,null,null,null,"2016-07-23","16/17","15/16","14/15",null,"2016-07-23","N/A","15/16","14/15"]
[null,null,null,null,null,null,null,"2016-07-24","16/17","15/16","14/15",null,"2016-07-24","N/A","15/16","14/15"]
[null,null,null,null,null,null,null,"2016-07-25","16/17","15/16","14/15",null,"2016-07-25","N/A","15/16","14/15"]
[null,null,null,null,null,null,null,"2016-07-26","16/17","15/16","14/15",null,"2016-07-26","N/A","15/16","14/15"]
[null,null,null,null,null,null,null,"2016-07-27","16/17","15/16","14/15",null,"2016-07-27","N/A","15/16","14/15"]
[null,null,null,null,null,null,null,"2016-07-28","16/17","15/16","14/15",null,"2016-07-28","N/A","15/16","14/15"]
[null,null,null,null,null,null,null,"2016-07-29","16/17","15/16","14/15",null,"2016-07-29","N/A","15/16","14/15"]
[null,null,null,null,null,null,null,"2016-07-30","16/17","15/16","14/15",null,"2016-07-30","N/A","15/16","14/15"]
[null,null,null,null,null,null,null,"2016-07-31","16/17","15/16","14/15",null,"2016-07-31","N/A","15/16","14/15"]
[null,null,null,null,null,null,null,"2016-08-01","16/17","15/16","14/15",null,"2016-08-01","N/A","15/16","14/15"]
[null,null,null,null,null,null,null,"2016-08-02","16/17","15/16","14/15",null,"2016-08-02","N/A","15/16","14/15"]
[null,null,null,null,null,null,null,"2016-08-03","16/17","15/16","14/15",null,"2016-08-03","N/A","15/16","14/15"]
[null,null,null,null,null,null,null,"2016-08-04","16/17","15/16","14/15",null,"2016-08-04","N/A","15/16","14/15"]
[null,null,null,null,null,null,null,"2016-08-05","16/17","15/16","14/15",null,"2016-08-05","N/A","15/16","14/15"]
[null,null,null,null,null,null,null,"2016-08-06","16/17","15/16","14/15",null,"2016-08-06","N/A","15/16","14/15"]
[null,null,null,null,null,null,null,"2016-08-07","16/17","15/16","14/15",null,"2016-08-07","N/A","15/16","14/15"]
[null,null,null,null,null,null,null,"2016-08-08","16/17","15/16","14/15",null,"2016-08-08","N/A","15/16","14/15"]
[null,null,null,null,null,null,null,"2016-08-09","16/17","15/16","14/15",null,"2016-08-09","N/A","15/16","14/15"]
[null,null,null,null,null,null,null,"2016-08-10","16/17","15/16","14/15",null,"2016-08-10","N/A","15/16","14/15"]
[null,null,null,null,null,null,null,"2016-08-11","16/17","15/16","14/15",null,"2016-08-11","N/A","15/16","14/15"]
[null,null,null,null,null,null,null,"2016-08-12","16/17","15/16","14/15",null,"2016-08-12","N/A","15/16","14/15"]
[null,null,null,null,null,null,null,"2016-08-13","16/17","15/16","14/15",null,"2016-08-13","N/A","15/16","14/15"]
[null,null,null,null,null,null,null,"2016-08-14","16/17","15/16","14/15",null,"2016-08-14","N/A","15/16","14/15"]
[null,null,null,null,null,null,null,"2016-08-15","16/17","15/16","14/15",null,"2016-08-15","N/A","15/16","14/15"]
[null,null,null,null,null,null,null,"2016-08-16","16/17","15/16","14/15",null,"2016-08-16","N/A","15/16","14/15"]
[null,null,null,null,null,null,null,"2016-08-17","16/17","15/16","14/15",null,"2016-08-17","N/A","15/16","14/15"]
[null,null,null,null,null,null,null,"2016-08-18","16/17","15/16","14/15",null,"2016-08-18","N/A","15/16","14/15"]
[null,null,null,null,null,null,null,"2016-08-19","16/17","15/16","14/15",null,"2016-08-19","N/A","15/16","14/15"]
[null,null,null,null,null,null,null,"2016-08-20","16/17","15/16","14/15",null,"2016-08-20","N/A","15/16","14/15"]
[null,null,null,null,null,null,null,"2016-08-21","16/17","15/16","14/15",null,"2016-08-21","N/A","15/16","14/15"]
[null,null,null,null,null,null,null,"2016-08-22","16/17","15/16","14/15",null,"2016-08-22","N/A","15/16","14/15"]
[null,null,null,null,null,null,null,"2016-08-23","16/17","15/16","14/15",null,"2016-08-23","N/A","15/16","14/15"]
[null,null,null,null,null,null,null,"2016-08-24","16/17","15/16","14/15",null,"2016-08-24","N/A","15/16","14/15"]
[null,null,null,null,null,null,null,"2016-08-25","16/17","15/16","14/15",null,"2016-08-25","N/A","15/16","14/15"]
[null,null,null,null,null,null,null,"2016-08-26","16/17","15/16","14/15",null,"2016-08-26","N/A","15/16","14/15"]
[null,null,null,null,null,null,null,"2016-08-27","16/17","15/16","14/15",null,"2016-08-27","N/A","15/16","14/15"]
[null,null,null,null,null,null,null,"2016-08-28","16/17","15/16","14/15",null,"2016-08-28","N/A","15/16","14/15"]
[null,null,null,null,null,null,null,"2016-08-29","16/17","15/16","14/15",null,"2016-08-29","N/A","15/16","14/15"]
[null,null,null,null,null,null,null,"2016-08-30","16/17","15/16","14/15",null,"2016-08-30","N/A","15/16","14/15"]
[null,null,null,null,null,null,null,"2016-08-31","16/17","15/16","14/15",null,"2016-08-31","N/A","15/16","14/15"]
[null,null,null,null,null,null,null,"2016-09-01","16/17","15/16","14/15",null,"2016-09-01","N/A","15/16","14/15"]
[null,null,null,null,null,null,null,"2016-09-02","16/17","15/16","14/15",null,"2016-09-02","N/A","15/16","14/15"]
[null,null,null,null,null,null,null,"2016-09-03","16/17","15/16","14/15",null,"2016-09-03","N/A","15/16","14/15"]
[null,null,null,null,null,null,null,"2016-09-04","16/17","15/16","14/15",null,"2016-09-04","N/A","15/16","14/15"]
[null,null,null,null,null,null,null,"2016-09-05","16/17","15/16","14/15",null,"2016-09-05","N/A","15/16","14/15"]
[null,null,null,null,null,null,null,"2016-09-06","16/17","15/16","14/15",null,"2016-09-06","N/A","15/16","14/15"]
[null,null,null,null,null,null,null,"2016-09-07","16/17","15/16","14/15",null,"2016-09-07","N/A","15/16","14/15"]
[null,null,null,null,null,null,null,"2016-09-08","16/17","15/16","14/15",null,"2016-09-08","N/A","15/16","14/15"]
[null,null,null,null,null,null,null,"2016-09-09","16/17","15/16","14/15",null,"2016-09-09","N/A","15/16","14/15"]
[null,null,null,null,null,null,null,"2016-09-10","16/17","15/16","14/15",null,"2016-09-10","N/A","15/16","14/15"]
[null,null,null,null,null,null,null,"2016-09-11","16/17","15/16","14/15",null,"2016-09-11","N/A","15/16","14/15"]
[null,null,null,null,null,null,null,"2016-09-12","16/17","15/16","14/15",null,"2016-09-12","N/A","15/16","14/15"]
[null,null,null,null,null,null,null,"2016-09-13","16/17","15/16","14/15",null,"2016-09-13","N/A","15/16","14/15"]
[null,null,null,null,null,null,null,"2016-09-14","16/17","15/16","14/15",null,"2016-09-14","N/A","15/16","14/15"]
[null,null,null,null,null,null,null,"2016-09-15","16/17","15/16","14/15",null,"2016-09-15","N/A","15/16","14/15"]
[null,null,null,null,null,null,null,"2016-09-16","16/17","15/16","14/15",null,"2016-09-16","N/A","15/16","14/15"]
[null,null,null,null,null,null,null,"2016-09-17","16/17","15/16","14/15",null,"2016-09-17","N/A","15/16","14/15"]
[null,null,null,null,null,null,null,"2016-09-18","16/17","15/16","14/15",null,"2016-09-18","N/A","15/16","14/15"]
[null,null,null,null,null,null,null,"2016-09-19","16/17","15/16","14/15",null,"2016-09-19","N/A","15/16","14/15"]
[null,null,null,null,null,null,null,"2016-09-20","16/17","15/16","14/15",null,"2016-09-20","N/A","15/16","14/15"]
[null,null,null,null,null,null,null,"2016-09-21","16/17","15/16","14/15",null,"2016-09-21","N/A","15/16","14/15"]
[null,null,null,null,null,null,null,"2016-09-22","16/17","15/16","14/15",null,"2016-09-22","N/A","15/16","14/15"]
[null,null,null,null,null,null,null,"2016-09-23","16/17","15/16","14/15",null,"2016-09-23","N/A","15/16","14/15"]
[null,null,null,null,null,null,null,"2016-09-24","16/17","15/16","14/15",null,"2016-09-24","N/A","15/16","14/15"]
[null,null,null,null,null,null,null,"2016-09-25","16/17","15/16","14/15",null,"2016-09-25","N/A","15/16","14/15"]
[null,null,null,null,null,null,null,"2016-09-26","16/17","15/16","14/15",null,"2016-09-26","N/A","15/16","14/15"]
[null,null,null,null,null,null,null,"2016-09-27","16/17","15/16","14/15",null,"2016-09-27","N/A","15/16","14/15"]
[null,null,null,null,null,null,null,"2016-09-28","16/17","15/16","14/15",null,"2016-09-28","N/A","15/16","14/15"]
[null,null,null,null,null,null,null,"2016-09-29","16/17","15/16","14/15",null,"2016-09-29","N/A","15/16","14/15"]
[null,null,null,null,null,null,null,"2016-09-30","16/17","15/16","14/15",null,"2016-09-30","N/A","15/16","14/15"]
[null,null,null,null,null,null,null,"2016-10-01","16/17","15/16","14/15",null,"2016-10-01","N/A","15/16","14/15"]
[null,null,null,null,null,null,null,"2016-10-02","16/17","15/16","14/15",null,"2016-10-02","N/A","15/16","14/15"]
[null,null,null,null,null,null,null,"2016-10-03","16/17","15/16","14/15",null,"2016-10-03","N/A","15/16","14/15"]
[null,null,null,null,null,null,null,"2016-10-04","16/17","15/16","14/15",null,"2016-10-04","N/A","15/16","14/15"]
[null,null,null,null,null,null,null,"2016-10-05","16/17","15/16","14/15",null,"2016-10-05","N/A","15/16","14/15"]
[null,null,null,null,null,null,null,"2016-10-06","16/17","15/16","14/15",null,"2016-10-06","N/A","15/16","14/15"]
[null,null,null,null,null,null,null,"2016-10-07","16/17","15/16","14/15",null,"2016-10-07","N/A","15/16","14/15"]
[null,null,null,null,null,null,null,"2016-10-08","16/17","15/16","14/15",null,"2016-10-08","N/A","15/16","14/15"]
[null,null,null,null,null,null,null,"2016-10-09","16/17","15/16","14/15",null,"2016-10-09","N/A","15/16","14/15"]
[null,null,null,null,null,null,null,"2016-10-10","16/17","15/16","14/15",null,"2016-10-10","N/A","15/16","14/15"]
[null,null,null,null,null,null,null,"2016-10-11","16/17","15/16","14/15",null,"2016-10-11","N/A","15/16","14/15"]
[null,null,null,null,null,null,null,"2016-10-12","16/17","15/16","14/15",null,"2016-10-12","N/A","15/16","14/15"]
[null,null,null,null,null,null,null,"2016-10-13","16/17","15/16","14/15",null,"2016-10-13","N/A","15/16","14/15"]
[null,null,null,null,null,null,null,"2016-10-14","16/17","15/16","14/15",null,"2016-10-14","N/A","15/16","14/15"]
[null,null,null,null,null,null,null,"2016-10-15","16/17","15/16","14/15",null,"2016-10-15","N/A","15/16","14/15"]
[null,null,null,null,null,null,null,"2016-10-16","16/17","15/16","14/15",null,"2016-10-16","N/A","15/16","14/15"]
[null,null,null,null,null,null,null,"2016-10-17","16/17","15/16","14/15",null,"2016-10-17","N/A","15/16","14/15"]
[null,null,null,null,null,null,null,"2016-10-18","16/17","15/16","14/15",null,"2016-10-18","N/A","15/16","14/15"]
[null,null,null,null,null,null,null,"2016-10-19","16/17","15/16","14/15",null,"2016-10-19","N/A","15/16","14/15"]
[null,null,null,null,null,null,null,"2016-10-20","16/17","15/16","14/15",null,"2016-10-20","N/A","15/16","14/15"]
[null,null,null,null,null,null,null,"2016-10-21","16/17","15/16","14/15",null,"2016-10-21","N/A","15/16","14/15"]
[null,null,null,null,null,null,null,"2016-10-22","16/17","15/16","14/15",null,"2016-10-22","N/A","15/16","14/15"]
[null,null,null,null,null,null,null,"2016-10-23","16/17","15/16","14/15",null,"2016-10-23","N/A","15/16","14/15"]
[null,null,null,null,null,null,null,"2016-10-24","16/17","15/16","14/15",null,"2016-10-24","N/A","15/16","14/15"]
[null,null,null,null,null,null,null,"2016-10-25","16/17","15/16","14/15",null,"2016-10-25","N/A","15/16","14/15"]
[null,null,null,null,null,null,null,"2016-10-26","16/17","15/16","14/15",null,"2016-10-26","N/A","15/16","14/15"]
[null,null,null,null,null,null,null,"2016-10-27","16/17","15/16","14/15",null,"2016-10-27","N/A","15/16","14/15"]
[null,null,null,null,null,null,null,"2016-10-28","16/17","15/16","14/15",null,"2016-10-28","N/A","15/16","14/15"]
[null,null,null,null,null,null,null,"2016-10-29","16/17","15/16","14/15",null,"2016-10-29","N/A","15/16","14/15"]
[null,null,null,null,null,null,null,"2016-10-30","16/17","15/16","14/15",null,"2016-10-30","N/A","15/16","14/15"]
[null,null,null,null,null,null,null,"2016-10-31","16/17","15/16","14/15",null,"2016-10-31","N/A","15/16","14/15"]
[null,null,null,null,null,null,null,"2016-11-01","16/17","15/16","14/15",null,"2016-11-01","N/A","15/16","14/15"]
[null,null,null,null,null,null,null,"2016-11-02","16/17","15/16","14/15",null,"2016-11-02","N/A","15/16","14/15"]
[null,null,null,null,null,null,null,"2016-11-03","16/17","15/16","14/15",null,"2016-11-03","N/A","15/16","14/15"]
[null,null,null,null,null,null,null,"2016-11-04","16/17","15/16","14/15",null,"2016-11-04","N/A","15/16","14/15"]
[null,null,null,null,null,null,null,"2016-11-05","16/17","15/16","14/15",null,"2016-11-05","N/A","15/16","14/15"]
[null,null,null,null,null,null,null,"2016-11-06","16/17","15/16","14/15",null,"2016-11-06","N/A","15/16","14/15"]
[null,null,null,null,null,null,null,"2016-11-07","16/17","15/16","14/15",null,"2016-11-07","N/A","15/16","14/15"]
[null,null,null,null,null,null,null,"2016-11-08","16/17","15/16","14/15",null,"2016-11-08","N/A","15/16","14/15"]
[null,null,null,null,null,null,null,"2016-11-09","16/17","15/16","14/15",null,"2016-11-09","N/A","15/16","14/15"]
[null,null,null,null,null,null,null,"2016-11-10","16/17","15/16","14/15",null,"2016-11-10","N/A","15/16","14/15"]
[null,null,null,null,null,null,null,"2016-11-11","16/17","15/16","14/15",null,"2016-11-11","N/A","15/16","14/15"]
[null,null,null,null,null,null,null,"2016-11-12","16/17","15/16","14/15",null,"2016-11-12","N/A","15/16","14/15"]
[null,null,null,null,null,null,null,"2016-11-13","16/17","15/16","14/15",null,"2016-11-13","N/A","15/16","14/15"]
[null,null,null,null,null,null,null,"2016-11-14","16/17","15/16","14/15",null,"2016-11-14","N/A","15/16","14/15"]
[null,null,null,null,null,null,null,"2016-11-15","16/17","15/16","14/15",null,"2016-11-15","N/A","15/16","14/15"]
[null,null,null,null,null,null,null,"2016-11-16","16/17","15/16","14/15",null,"2016-11-16","N/A","15/16","14/15"]
[null,null,null,null,null,null,null,"2016-11-17","16/17","15/16","14/15",null,"2016-11-17","N/A","15/16","14/15"]
[null,null,null,null,null,null,null,"2016-11-18","16/17","15/16","14/15",null,"2016-11-18","N/A","15/16","14/15"]
[null,null,null,null,null,null,null,"2016-11-19","16/17","15/16","14/15",null,"2016-11-19","N/A","15/16","14/15"]
[null,null,null,null,null,null,null,"2016-11-20","16/17","15/16","14/15",null,"2016-11-20","N/A","15/16","14/15"]
[null,null,null,null,null,null,null,"2016-11-21","16/17","15/16","14/15",null,"2016-11-21","N/A","15/16","14/15"]
[null,null,null,null,null,null,null,"2016-11-22","16/17","15/16","14/15",null,"2016-11-22","N/A","15/16","14/15"]
[null,null,null,null,null,null,null,"2016-11-23","16/17","15/16","14/15",null,"2016-11-23","N/A","15/16","14/15"]
[null,null,null,null,null,null,null,"2016-11-24","16/17","15/16","14/15",null,"2016-11-24","N/A","15/16","14/15"]
[null,null,null,null,null,null,null,"2016-11-25","16/17","15/16","14/15",null,"2016-11-25","N/A","15/16","14/15"]
[null,null,null,null,null,null,null,"2016-11-26","16/17","15/16","14/15",null,"2016-11-26","N/A","15/16","14/15"]
[null,null,null,null,null,null,null,"2016-11-27","16/17","15/16","14/15",null,"2016-11-27","N/A","15/16","14/15"]
[null,null,null,null,null,null,null,"2016-11-28","16/17","15/16","14/15",null,"2016-11-28","N/A","15/16","14/15"]
[null,null,null,null,null,null,null,"2016-11-29","16/17","15/16","14/15",null,"2016-11-29","N/A","15/16","14/15"]
[null,null,null,null,null,null,null,"2016-11-30","16/17","15/16","14/15",null,"2016-11-30","N/A","15/16","14/15"]
[null,null,null,null,null,null,null,"2016-12-01","16/17","15/16","14/15",null,"2016-12-01","N/A","15/16","14/15"]
[null,null,null,null,null,null,null,"2016-12-02","16/17","15/16","14/15",null,"2016-12-02","N/A","15/16","14/15"]
[null,null,null,null,null,null,null,"2016-12-03","16/17","15/16","14/15",null,"2016-12-03","N/A","15/16","14/15"]
[null,null,null,null,null,null,null,"2016-12-04","16/17","15/16","14/15",null,"2016-12-04","N/A","15/16","14/15"]
[null,null,null,null,null,null,null,"2016-12-05","16/17","15/16","14/15",null,"2016-12-05","N/A","15/16","14/15"]
[null,null,null,null,null,null,null,"2016-12-06","16/17","15/16","14/15",null,"2016-12-06","N/A","15/16","14/15"]
[null,null,null,null,null,null,null,"2016-12-07","16/17","15/16","14/15",null,"2016-12-07","N/A","15/16","14/15"]
[null,null,null,null,null,null,null,"2016-12-08","16/17","15/16","14/15",null,"2016-12-08","N/A","15/16","14/15"]
[null,null,null,null,null,null,null,"2016-12-09","16/17","15/16","14/15",null,"2016-12-09","N/A","15/16","14/15"]
[null,null,null,null,null,null,null,"2016-12-10","16/17","15/16","14/15",null,"2016-12-10","N/A","15/16","14/15"]
[null,null,null,null,null,null,null,"2016-12-11","16/17","15/16","14/15",null,"2016-12-11","N/A","15/16","14/15"]
[null,null,null,null,null,null,null,"2016-12-12","16/17","15/16","14/15",null,"2016-12-12","N/A","15/16","14/15"]
[null,null,null,null,null,null,null,"2016-12-13","16/17","15/16","14/15",null,"2016-12-13","N/A","15/16","14/15"]
[null,null,null,null,null,null,null,"2016-12-14","16/17","15/16","14/15",null,"2016-12-14","N/A","15/16","14/15"]
[null,null,null,null,null,null,null,"2016-12-15","16/17","15/16","14/15",null,"2016-12-15","N/A","15/16","14/15"]
[null,null,null,null,null,null,null,"2016-12-16","16/17","15/16","14/15",null,"2016-12-16","N/A","15/16","14/15"]
[null,null,null,null,null,null,null,"2016-12-17","16/17","15/16","14/15",null,"2016-12-17","N/A","15/16","14/15"]
[null,null,null,null,null,null,null,"2016-12-18","16/17","15/16","14/15",null,"2016-12-18","N/A","15/16","14/15"]
[null,null,null,null,null,null,null,"2016-12-19","16/17","15/16","14/15",null,"2016-12-19","N/A","15/16","14/15"]
[null,null,null,null,null,null,null,"2016-12-20","16/17","15/16","14/15",null,"2016-12-20","N/A","15/16","14/15"]
[null,null,null,null,null,null,null,"2016-12-21","16/17","15/16","14/15",null,"2016-12-21","N/A","15/16","14/15"]
[null,null,null,null,null,null,null,"2016-12-22","16/17","15/16","14/15",null,"2016-12-22","N/A","15/16","14/15"]
[null,null,null,null,null,null,null,"2016-12-23","16/17","15/16","14/15",null,"2016-12-23","N/A","15/16","14/15"]
[null,null,null,null,null,null,null,"2016-12-24","16/17","15/16","14/15",null,"2016-12-24","N/A","15/16","14/15"]
[null,null,null,null,null,null,null,"2016-12-25","16/17","15/16","14/15",null,"2016-12-25","N/A","15/16","14/15"]
[null,null,null,null,null,null,null,"2016-12-26","16/17","15/16","14/15",null,"2016-12-26","N/A","15/16","14/15"]
[null,null,null,null,null,null,null,"2016-12-27","16/17","15/16","14/15",null,"2016-12-27","N/A","15/16","14/15"]
[null,null,null,null,null,null,null,"2016-12-28","16/17","15/16","14/15",null,"2016-12-28","N/A","15/16","14/15"]
[null,null,null,null,null,null,null,"2016-12-29","16/17","15/16","14/15",null,"2016-12-29","N/A","15/16","14/15"]
[null,null,null,null,null,null,null,"2016-12-30","16/17","15/16","14/15",null,"2016-12-30","N/A","15/16","14/15"]
[null,null,null,null,null,null,null,"2016-12-31","16/17","15/16","14/15",null,"2016-12-31","N/A","15/16","14/15"]
[null,null,null,null,null,null,null,"2017-01-01","16/17","15/16","14/15",null,"2017-01-01","N/A","15/16","14/15"]
[null,null,null,null,null,null,null,"2017-01-02","16/17","15/16","14/15",null,"2017-01-02","N/A","15/16","14/15"]
[null,null,null,null,null,null,null,"2017-01-03","16/17","15/16","14/15",null,"2017-01-03","N/A","15/16","14/15"]
[null,null,null,null,null,null,null,"2017-01-04","16/17","15/16","14/15",null,"2017-01-04","N/A","15/16","14/15"]
[null,null,null,null,null,null,null,"2017-01-05","16/17","15/16","14/15",null,"2017-01-05","N/A","15/16","14/15"]
[null,null,null,null,null,null,null,"2017-01-06","16/17","15/16","14/15",null,"2017-01-06","N/A","15/16","14/15"]
[null,null,null,null,null,null,null,"2017-01-07","16/17","15/16","14/15",null,"2017-01-07","N/A","15/16","14/15"]
[null,null,null,null,null,null,null,"2017-01-08","16/17","15/16","14/15",null,"2017-01-08","N/A","15/16","14/15"]
[null,null,null,null,null,null,null,"2017-01-09","16/17","15/16","14/15",null,"2017-01-09","N/A","15/16","14/15"]
[null,null,null,null,null,null,null,"2017-01-10","16/17","15/16","14/15",null,"2017-01-10","N/A","15/16","14/15"]
[null,null,null,null,null,null,null,"2017-01-11","16/17","15/16","14/15",null,"2017-01-11","N/A","15/16","14/15"]
[null,null,null,null,null,null,null,"2017-01-12","16/17","15/16","14/15",null,"2017-01-12","N/A","15/16","14/15"]
[null,null,null,null,null,null,null,"2017-01-13","16/17","15/16","14/15",null,"2017-01-13","N/A","15/16","14/15"]
[null,null,null,null,null,null,null,"2017-01-14","16/17","15/16","14/15",null,"2017-01-14","N/A","15/16","14/15"]
[null,null,null,null,null,null,null,"2017-01-15","16/17","15/16","14/15",null,"2017-01-15","N/A","15/16","14/15"]
[null,null,null,null,null,null,null,"2017-01-16","16/17","15/16","14/15",null,"2017-01-16","N/A","15/16","14/15"]
[null,null,null,null,null,null,null,"2017-01-17","16/17","15/16","14/15",null,"2017-01-17","N/A","15/16","14/15"]
[null,null,null,null,null,null,null,"2017-01-18","16/17","15/16","14/15",null,"2017-01-18","N/A","15/16","14/15"]
[null,null,null,null,null,null,null,"2017-01-19","16/17","15/16","14/15",null,"2017-01-19","N/A","15/16","14/15"]
[null,null,null,null,null,null,null,"2017-01-20","16/17","15/16","14/15",null,"2017-01-20","N/A","15/16","14/15"]
[null,null,null,null,null,null,null,"2017-01-21","16/17","15/16","14/15",null,"2017-01-21","N/A","15/16","14/15"]
[null,null,null,null,null,null,null,"2017-01-22","16/17","15/16","14/15",null,"2017-01-22","N/A","15/16","14/15"]
[null,null,null,null,null,null,null,"2017-01-23","16/17","15/16","14/15",null,"2017-01-23","N/A","15/16","14/15"]
[null,null,null,null,null,null,null,"2017-01-24","16/17","15/16","14/15",null,"2017-01-24","N/A","15/16","14/15"]
[null,null,null,null,null,null,null,"2017-01-25","16/17","15/16","14/15",null,"2017-01-25","N/A","15/16","14/15"]
[null,null,null,null,null,null,null,"2017-01-26","16/17","15/16","14/15",null,"2017-01-26","N/A","15/16","14/15"]
[null,null,null,null,null,null,null,"2017-01-27","16/17","15/16","14/15",null,"2017-01-27","N/A","15/16","14/15"]
[null,null,null,null,null,null,null,"2017-01-28","16/17","15/16","14/15",null,"2017-01-28","N/A","15/16","14/15"]
[null,null,null,null,null,null,null,"2017-01-29","16/17","15/16","14/15",null,"2017-01-29","N/A","15/16","14/15"]
[null,null,null,null,null,null,null,"2017-01-30","16/17","15/16","14/15",null,"2017-01-30","N/A","15/16","14/15"]
[null,null,null,null,null,null,null,"2017-01-31","16/17","15/16","14/15",null,"2017-01-31","N/A","15/16","14/15"]
[null,null,null,null,null,null,null,"2017-02-01","16/17","15/16","14/15",null,"2017-02-01","N/A","15/16","14/15"]
[null,null,null,null,null,null,null,"2017-02-02","16/17","15/16","14/15",null,"2017-02-02","N/A","15/16","14/15"]
[null,null,null,null,null,null,null,"2017-02-03","16/17","15/16","14/15",null,"2017-02-03","N/A","15/16","14/15"]
[null,null,null,null,null,null,null,"2017-02-04","16/17","15/16","14/15",null,"2017-02-04","N/A","15/16","14/15"]
[null,null,null,null,null,null,null,"2017-02-05","16/17","15/16","14/15",null,"2017-02-05","N/A","15/16","14/15"]
[null,null,null,null,null,null,null,"2017-02-06","16/17","15/16","14/15",null,"2017-02-06","N/A","15/16","14/15"]
[null,null,null,null,null,null,null,"2017-02-07","16/17","15/16","14/15",null,"2017-02-07","N/A","15/16","14/15"]
[null,null,null,null,null,null,null,"2017-02-08","16/17","15/16","14/15",null,"2017-02-08","N/A","15/16","14/15"]
[null,null,null,null,null,null,null,"2017-02-09","16/17","15/16","14/15",null,"2017-02-09","N/A","15/16","14/15"]
[null,null,null,null,null,null,null,"2017-02-10","16/17","15/16","14/15",null,"2017-02-10","N/A","15/16","14/15"]
[null,null,null,null,null,null,null,"2017-02-11","16/17","15/16","14/15",null,"2017-02-11","N/A","15/16","14/15"]
[null,null,null,null,null,null,null,"2017-02-12","16/17","15/16","14/15",null,"2017-02-12","N/A","15/16","14/15"]
[null,null,null,null,null,null,null,"2017-02-13","16/17","15/16","14/15",null,"2017-02-13","N/A","15/16","14/15"]
[null,null,null,null,null,null,null,"2017-02-14","16/17","15/16","14/15",null,"2017-02-14","N/A","15/16","14/15"]
[null,null,null,null,null,null,null,"2017-02-15","16/17","15/16","14/15",null,"2017-02-15","N/A","15/16","14/15"]
[null,null,null,null,null,null,null,"2017-02-16","16/17","15/16","14/15",null,"2017-02-16","N/A","15/16","14/15"]
[null,null,null,null,null,null,null,"2017-02-17","16/17","15/16","14/15",null,"2017-02-17","N/A","15/16","14/15"]
[null,null,null,null,null,null,null,"2017-02-18","16/17","15/16","14/15",null,"2017-02-18","N/A","15/16","14/15"]
[null,null,null,null,null,null,null,"2017-02-19","16/17","15/16","14/15",null,"2017-02-19","N/A","15/16","14/15"]
[null,null,null,null,null,null,null,"2017-02-20","16/17","15/16","14/15",null,"2017-02-20","N/A","15/16","14/15"]
[null,null,null,null,null,null,null,"2017-02-21","16/17","15/16","14/15",null,"2017-02-21","N/A","15/16","14/15"]
[null,null,null,null,null,null,null,"2017-02-22","16/17","15/16","14/15",null,"2017-02-22","N/A","15/16","14/15"]
[null,null,null,null,null,null,null,"2017-02-23","16/17","15/16","14/15",null,"2017-02-23","N/A","15/16","14/15"]
[null,null,null,null,null,null,null,"2017-02-24","16/17","15/16","14/15",null,"2017-02-24","N/A","15/16","14/15"]
[null,null,null,null,null,null,null,"2017-02-25","16/17","15/16","14/15",null,"2017-02-25","N/A","15/16","14/15"]
[null,null,null,null,null,null,null,"2017-02-26","16/17","15/16","14/15",null,"2017-02-26","N/A","15/16","14/15"]
[null,null,null,null,null,null,null,"2017-02-27","16/17","15/16","14/15",null,"2017-02-27","N/A","15/16","14/15"]
[null,null,null,null,null,null,null,"2017-02-28","16/17","15/16","14/15",null,"2017-02-28","N/A","15/16","14/15"]
[null,null,null,null,null,null,null,"2017-03-01","16/17","15/16","14/15",null,"2017-03-01","N/A","15/16","14/15"]
[null,null,null,null,null,null,null,"2017-03-02","16/17","15/16","14/15",null,"2017-03-02","N/A","15/16","14/15"]
[null,null,null,null,null,null,null,"2017-03-03","16/17","15/16","14/15",null,"2017-03-03","N/A","15/16","14/15"]
[null,null,null,null,null,null,null,"2017-03-04","16/17","15/16","14/15",null,"2017-03-04","N/A","15/16","14/15"]
[null,null,null,null,null,null,null,"2017-03-05","16/17","15/16","14/15",null,"2017-03-05","N/A","15/16","14/15"]
[null,null,null,null,null,null,null,"2017-03-06","16/17","15/16","14/15",null,"2017-03-06","N/A","15/16","14/15"]
[null,null,null,null,null,null,null,"2017-03-07","16/17","15/16","14/15",null,"2017-03-07","N/A","15/16","14/15"]
[null,null,null,null,null,null,null,"2017-03-08","16/17","15/16","14/15",null,"2017-03-08","N/A","15/16","14/15"]
[null,null,null,null,null,null,null,"2017-03-09","16/17","15/16","14/15",null,"2017-03-09","N/A","15/16","14/15"]
[null,null,null,null,null,null,null,"2017-03-10","16/17","15/16","14/15",null,"2017-03-10","N/A","15/16","14/15"]
[null,null,null,null,null,null,null,"2017-03-11","16/17","15/16","14/15",null,"2017-03-11","N/A","15/16","14/15"]
[null,null,null,null,null,null,null,"2017-03-12","16/17","15/16","14/15",null,"2017-03-12","N/A","15/16","14/15"]
[null,null,null,null,null,null,null,"2017-03-13","16/17","15/16","14/15",null,"2017-03-13","N/A","15/16","14/15"]
[null,null,null,null,null,null,null,"2017-03-14","16/17","15/16","14/15",null,"2017-03-14","N/A","15/16","14/15"]
[null,null,null,null,null,null,null,"2017-03-15","16/17","15/16","14/15",null,"2017-03-15","N/A","15/16","14/15"]
[null,null,null,null,null,null,null,"2017-03-16","16/17","15/16","14/15",null,"2017-03-16","N/A","15/16","14/15"]
[null,null,null,null,null,null,null,"2017-03-17","16/17","15/16","14/15",null,"2017-03-17","N/A","15/16","14/15"]
[null,null,null,null,null,null,null,"2017-03-18","16/17","15/16","14/15",null,"2017-03-18","N/A","15/16","14/15"]
[null,null,null,null,null,null,null,"2017-03-19","16/17","15/16","14/15",null,"2017-03-19","N/A","15/16","14/15"]
[null,null,null,null,null,null,null,"2017-03-20","16/17","15/16","14/15",null,"2017-03-20","N/A","15/16","14/15"]
[null,null,null,null,null,null,null,"2017-03-21","16/17","15/16","14/15",null,"2017-03-21","N/A","15/16","14/15"]
[null,null,null,null,null,null,null,"2017-03-22","16/17","15/16","14/15",null,"2017-03-22","N/A","15/16","14/15"]
[null,null,null,null,null,null,null,"2017-03-23","16/17","15/16","14/15",null,"2017-03-23","N/A","15/16","14/15"]
[null,null,null,null,null,null,null,"2017-03-24","16/17","15/16","14/15",null,"2017-03-24","N/A","15/16","14/15"]
[null,null,null,null,null,null,null,"2017-03-25","16/17","15/16","14/15",null,"2017-03-25","N/A","15/16","14/15"]
[null,null,null,null,null,null,null,"2017-03-26","16/17","15/16","14/15",null,"2017-03-26","N/A","15/16","14/15"]
[null,null,null,null,null,null,null,"2017-03-27","16/17","15/16","14/15",null,"2017-03-27","N/A","15/16","14/15"]
[null,null,null,null,null,null,null,"2017-03-28","16/17","15/16","14/15",null,"2017-03-28","N/A","15/16","14/15"]
[null,null,null,null,null,null,null,"2017-03-29","16/17","15/16","14/15",null,"2017-03-29","N/A","15/16","14/15"]
[null,null,null,null,null,null,null,"2017-03-30","16/17","15/16","14/15",null,"2017-03-30","N/A","15/16","14/15"]
[null,null,null,null,null,null,null,"2017-03-31","16/17","15/16","14/15",null,"2017-03-31","N/A","15/16","14/15"]
[null,null,null,null,null,null,null,"2017-04-01","16/17","15/16","14/15",null,"2017-04-01","N/A","15/16","14/15"]
[null,null,null,null,null,null,null,"2017-04-02","16/17","15/16","14/15",null,"2017-04-02","N/A","15/16","14/15"]
[null,null,null,null,null,null,null,"2017-04-03","16/17","15/16","14/15",null,"2017-04-03","N/A","15/16","14/15"]
[null,null,null,null,null,null,null,"2017-04-04","16/17","15/16","14/15",null,"2017-04-04","N/A","15/16","14/15"]
[null,null,null,null,null,null,null,"2017-04-05","16/17","15/16","15/16",null,"2017-04-05","N/A","15/16","15/16"]
[null,null,null,null,null,null,null,"2017-04-06","17/18","16/17","15/16",null,"2017-04-06","N/A","N/A","15/16"]
[null,null,null,null,null,null,null,"2017-04-07","17/18","16/17","15/16",null,"2017-04-07","N/A","N/A","15/16"]
[null,null,null,null,null,null,null,"2017-04-08","17/18","16/17","15/16",null,"2017-04-08","N/A","N/A","15/16"]
[null,null,null,null,null,null,null,"2017-04-09","17/18","16/17","15/16",null,"2017-04-09","N/A","N/A","15/16"]
[null,null,null,null,null,null,null,"2017-04-10","17/18","16/17","15/16",null,"2017-04-10","N/A","N/A","15/16"]
[null,null,null,null,null,null,null,"2017-04-11","17/18","16/17","15/16",null,"2017-04-11","N/A","N/A","15/16"]
[null,null,null,null,null,null,null,"2017-04-12","17/18","16/17","15/16",null,"2017-04-12","N/A","N/A","15/16"]
[null,null,null,null,null,null,null,"2017-04-13","17/18","16/17","15/16",null,"2017-04-13","N/A","N/A","15/16"]
[null,null,null,null,null,null,null,"2017-04-14","17/18","16/17","15/16",null,"2017-04-14","N/A","N/A","15/16"]
[null,null,null,null,null,null,null,"2017-04-15","17/18","16/17","15/16",null,"2017-04-15","N/A","N/A","15/16"]
[null,null,null,null,null,null,null,"2017-04-16","17/18","16/17","15/16",null,"2017-04-16","N/A","N/A","15/16"]
[null,null,null,null,null,null,null,"2017-04-17","17/18","16/17","15/16",null,"2017-04-17","N/A","N/A","15/16"]
[null,null,null,null,null,null,null,"2017-04-18","17/18","16/17","15/16",null,"2017-04-18","N/A","N/A","15/16"]
[null,null,null,null,null,null,null,"2017-04-19","17/18","16/17","15/16",null,"2017-04-19","N/A","N/A","15/16"]
[null,null,null,null,null,null,null,"2017-04-20","17/18","16/17","15/16",null,"2017-04-20","N/A","N/A","15/16"]
[null,null,null,null,null,null,null,"2017-04-21","17/18","16/17","15/16",null,"2017-04-21","N/A","N/A","15/16"]
[null,null,null,null,null,null,null,"2017-04-22","17/18","16/17","15/16",null,"2017-04-22","N/A","N/A","15/16"]
[null,null,null,null,null,null,null,"2017-04-23","17/18","16/17","15/16",null,"2017-04-23","N/A","N/A","15/16"]
[null,null,null,null,null,null,null,"2017-04-24","17/18","16/17","15/16",null,"2017-04-24","N/A","N/A","15/16"]
[null,null,null,null,null,null,null,"2017-04-25","17/18","16/17","15/16",null,"2017-04-25","N/A","N/A","15/16"]
[null,null,null,null,null,null,null,"2017-04-26","17/18","16/17","15/16",null,"2017-04-26","N/A","N/A","15/16"]
[null,null,null,null,null,null,null,"2017-04-27","17/18","16/17","15/16",null,"2017-04-27","N/A","N/A","15/16"]
[null,null,null,null,null,null,null,"2017-04-28","17/18","16/17","15/16",null,"2017-04-28","N/A","N/A","15/16"]
[null,null,null,null,null,null,null,"2017-04-29","17/18","16/17","15/16",null,"2017-04-29","N/A","N/A","15/16"]
[null,null,null,null,null,null,null,"2017-04-30","17/18","16/17","15/16",null,"2017-04-30","N/A","N/A","15/16"]
[null,null,null,null,null,null,null,"2017-05-01","17/18","16/17","15/16",null,"2017-05-01","N/A","N/A","15/16"]
[null,null,null,null,null,null,null,"2017-05-02","17/18","16/17","15/16",null,"2017-05-02","N/A","N/A","15/16"]
[null,null,null,null,null,null,null,"2017-05-03","17/18","16/17","15/16",null,"2017-05-03","N/A","N/A","15/16"]
[null,null,null,null,null,null,null,"2017-05-04","17/18","16/17","15/16",null,"2017-05-04","N/A","N/A","15/16"]
[null,null,null,null,null,null,null,"2017-05-05","17/18","16/17","15/16",null,"2017-05-05","N/A","N/A","15/16"]
[null,null,null,null,null,null,null,"2017-05-06","17/18","16/17","15/16",null,"2017-05-06","N/A","N/A","15/16"]
[null,null,null,null,null,null,null,"2017-05-07","17/18","16/17","15/16",null,"2017-05-07","N/A","N/A","15/16"]
[null,null,null,null,null,null,null,"2017-05-08","17/18","16/17","15/16",null,"2017-05-08","N/A","N/A","15/16"]
[null,null,null,null,null,null,null,"2017-05-09","17/18","16/17","15/16",null,"2017-05-09","N/A","N/A","15/16"]
[null,null,null,null,null,null,null,"2017-05-10","17/18","16/17","15/16",null,"2017-05-10","N/A","N/A","15/16"]
[null,null,null,null,null,null,null,"2017-05-11","17/18","16/17","15/16",null,"2017-05-11","N/A","N/A","15/16"]
[null,null,null,null,null,null,null,"2017-05-12","17/18","16/17","15/16",null,"2017-05-12","N/A","N/A","15/16"]
[null,null,null,null,null,null,null,"2017-05-13","17/18","16/17","15/16",null,"2017-05-13","N/A","N/A","15/16"]
[null,null,null,null,null,null,null,"2017-05-14","17/18","16/17","15/16",null,"2017-05-14","N/A","N/A","15/16"]
[null,null,null,null,null,null,null,"2017-05-15","17/18","16/17","15/16",null,"2017-05-15","N/A","N/A","15/16"]
[null,null,null,null,null,null,null,"2017-05-16","17/18","16/17","15/16",null,"2017-05-16","N/A","N/A","15/16"]
[null,null,null,null,null,null,null,"2017-05-17","17/18","16/17","15/16",null,"2017-05-17","N/A","N/A","15/16"]
[null,null,null,null,null,null,null,"2017-05-18","17/18","16/17","15/16",null,"2017-05-18","N/A","N/A","15/16"]
[null,null,null,null,null,null,null,"2017-05-19","17/18","16/17","15/16",null,"2017-05-19","N/A","N/A","15/16"]
[null,null,null,null,null,null,null,"2017-05-20","17/18","16/17","15/16",null,"2017-05-20","N/A","N/A","15/16"]
[null,null,null,null,null,null,null,"2017-05-21","17/18","16/17","15/16",null,"2017-05-21","N/A","N/A","15/16"]
[null,null,null,null,null,null,null,"2017-05-22","17/18","16/17","15/16",null,"2017-05-22","N/A","N/A","15/16"]
[null,null,null,null,null,null,null,"2017-05-23","17/18","16/17","15/16",null,"2017-05-23","N/A","N/A","15/16"]
[null,null,null,null,null,null,null,"2017-05-24","17/18","16/17","15/16",null,"2017-05-24","N/A","N/A","15/16"]
[null,null,null,null,null,null,null,"2017-05-25","17/18","16/17","15/16",null,"2017-05-25","N/A","N/A","15/16"]
[null,null,null,null,null,null,null,"2017-05-26","17/18","16/17","15/16",null,"2017-05-26","N/A","N/A","15/16"]
[null,null,null,null,null,null,null,"2017-05-27","17/18","16/17","15/16",null,"2017-05-27","N/A","N/A","15/16"]
[null,null,null,null,null,null,null,"2017-05-28","17/18","16/17","15/16",null,"2017-05-28","N/A","N/A","15/16"]
[null,null,null,null,null,null,null,"2017-05-29","17/18","16/17","15/16",null,"2017-05-29","N/A","N/A","15/16"]
[null,null,null,null,null,null,null,"2017-05-30","17/18","16/17","15/16",null,"2017-05-30","N/A","N/A","15/16"]
[null,null,null,null,null,null,null,"2017-05-31","17/18","16/17","15/16",null,"2017-05-31","N/A","N/A","15/16"]
[null,null,null,null,null,null,null,"2017-06-01","17/18","16/17","15/16",null,"2017-06-01","N/A","N/A","15/16"]
[null,null,null,null,null,null,null,"2017-06-02","17/18","16/17","15/16",null,"2017-06-02","N/A","N/A","15/16"]
[null,null,null,null,null,null,null,"2017-06-03","17/18","16/17","15/16",null,"2017-06-03","N/A","N/A","15/16"]
[null,null,null,null,null,null,null,"2017-06-04","17/18","16/17","15/16",null,"2017-06-04","N/A","N/A","15/16"]
[null,null,null,null,null,null,null,"2017-06-05","17/18","16/17","15/16",null,"2017-06-05","N/A","N/A","15/16"]
[null,null,null,null,null,null,null,"2017-06-06","17/18","16/17","15/16",null,"2017-06-06","N/A","N/A","15/16"]
[null,null,null,null,null,null,null,"2017-06-07","17/18","16/17","15/16",null,"2017-06-07","N/A","N/A","15/16"]
[null,null,null,null,null,null,null,"2017-06-08","17/18","16/17","15/16",null,"2017-06-08","N/A","N/A","15/16"]
[null,null,null,null,null,null,null,"2017-06-09","17/18","16/17","15/16",null,"2017-06-09","N/A","N/A","15/16"]
[null,null,null,null,null,null,null,"2017-06-10","17/18","16/17","15/16",null,"2017-06-10","N/A","N/A","15/16"]
[null,null,null,null,null,null,null,"2017-06-11","17/18","16/17","15/16",null,"2017-06-11","N/A","N/A","15/16"]
[null,null,null,null,null,null,null,"2017-06-12","17/18","16/17","15/16",null,"2017-06-12","N/A","N/A","15/16"]
[null,null,null,null,null,null,null,"2017-06-13","17/18","16/17","15/16",null,"2017-06-13","N/A","N/A","15/16"]
[null,null,null,null,null,null,null,"2017-06-14","17/18","16/17","15/16",null,"2017-06-14","N/A","N/A","15/16"]
[null,null,null,null,null,null,null,"2017-06-15","17/18","16/17","15/16",null,"2017-06-15","N/A","N/A","15/16"]
[null,null,null,null,null,null,null,"2017-06-16","17/18","16/17","15/16",null,"2017-06-16","N/A","N/A","15/16"]
[null,null,null,null,null,null,null,"2017-06-17","17/18","16/17","15/16",null,"2017-06-17","N/A","N/A","15/16"]
[null,null,null,null,null,null,null,"2017-06-18","17/18","16/17","15/16",null,"2017-06-18","N/A","N/A","15/16"]
[null,null,null,null,null,null,null,"2017-06-19","17/18","16/17","15/16",null,"2017-06-19","N/A","N/A","15/16"]
[null,null,null,null,null,null,null,"2017-06-20","17/18","16/17","15/16",null,"2017-06-20","N/A","N/A","15/16"]
[null,null,null,null,null,null,null,"2017-06-21","17/18","16/17","15/16",null,"2017-06-21","N/A","N/A","15/16"]
[null,null,null,null,null,null,null,"2017-06-22","17/18","16/17","15/16",null,"2017-06-22","N/A","N/A","15/16"]
[null,null,null,null,null,null,null,"2017-06-23","17/18","16/17","15/16",null,"2017-06-23","N/A","N/A","15/16"]
[null,null,null,null,null,null,null,"2017-06-24","17/18","16/17","15/16",null,"2017-06-24","N/A","N/A","15/16"]
[null,null,null,null,null,null,null,"2017-06-25","17/18","16/17","15/16",null,"2017-06-25","N/A","N/A","15/16"]
[null,null,null,null,null,null,null,"2017-06-26","17/18","16/17","15/16",null,"2017-06-26","N/A","N/A","15/16"]
[null,null,null,null,null,null,null,"2017-06-27","17/18","16/17","15/16",null,"2017-06-27","N/A","N/A","15/16"]
[null,null,null,null,null,null,null,"2017-06-28","17/18","16/17","15/16",null,"2017-06-28","N/A","N/A","15/16"]
[null,null,null,null,null,null,null,"2017-06-29","17/18","16/17","15/16",null,"2017-06-29","N/A","N/A","15/16"]
[null,null,null,null,null,null,null,"2017-06-30","17/18","16/17","15/16",null,"2017-06-30","N/A","N/A","15/16"]
[null,null,null,null,null,null,null,"2017-07-01","17/18","16/17","15/16",null,"2017-07-01","N/A","N/A","15/16"]
[null,null,null,null,null,null,null,"2017-07-02","17/18","16/17","15/16",null,"2017-07-02","N/A","N/A","15/16"]
[null,null,null,null,null,null,null,"2017-07-03","17/18","16/17","15/16",null,"2017-07-03","N/A","N/A","15/16"]
[null,null,null,null,null,null,null,"2017-07-04","17/18","16/17","15/16",null,"2017-07-04","N/A","N/A","15/16"]
[null,null,null,null,null,null,null,"2017-07-05","17/18","16/17","15/16",null,"2017-07-05","N/A","N/A","15/16"]
[null,null,null,null,null,null,null,"2017-07-06","17/18","16/17","15/16",null,"2017-07-06","N/A","N/A","15/16"]
[null,null,null,null,null,null,null,"2017-07-07","17/18","16/17","15/16",null,"2017-07-07","N/A","N/A","15/16"]
[null,null,null,null,null,null,null,"2017-07-08","17/18","16/17","15/16",null,"2017-07-08","N/A","N/A","15/16"]
[null,null,null,null,null,null,null,"2017-07-09","17/18","16/17","15/16",null,"2017-07-09","N/A","N/A","15/16"]
[null,null,null,null,null,null,null,"2017-07-10","17/18","16/17","15/16",null,"2017-07-10","N/A","N/A","15/16"]
[null,null,null,null,null,null,null,"2017-07-11","17/18","16/17","15/16",null,"2017-07-11","N/A","N/A","15/16"]
[null,null,null,null,null,null,null,"2017-07-12","17/18","16/17","15/16",null,"2017-07-12","N/A","N/A","15/16"]
[null,null,null,null,null,null,null,"2017-07-13","17/18","16/17","15/16",null,"2017-07-13","N/A","N/A","15/16"]
[null,null,null,null,null,null,null,"2017-07-14","17/18","16/17","15/16",null,"2017-07-14","N/A","N/A","15/16"]
[null,null,null,null,null,null,null,"2017-07-15","17/18","16/17","15/16",null,"2017-07-15","N/A","N/A","15/16"]
[null,null,null,null,null,null,null,"2017-07-16","17/18","16/17","15/16",null,"2017-07-16","N/A","N/A","15/16"]
[null,null,null,null,null,null,null,"2017-07-17","17/18","16/17","15/16",null,"2017-07-17","N/A","N/A","15/16"]
[null,null,null,null,null,null,null,"2017-07-18","17/18","16/17","15/16",null,"2017-07-18","N/A","N/A","15/16"]
[null,null,null,null,null,null,null,"2017-07-19","17/18","16/17","15/16",null,"2017-07-19","N/A","N/A","15/16"]
[null,null,null,null,null,null,null,"2017-07-20","17/18","16/17","15/16",null,"2017-07-20","N/A","N/A","15/16"]
[null,null,null,null,null,null,null,"2017-07-21","17/18","16/17","15/16",null,"2017-07-21","N/A","N/A","15/16"]
[null,null,null,null,null,null,null,"2017-07-22","17/18","16/17","15/16",null,"2017-07-22","N/A","N/A","15/16"]
[null,null,null,null,null,null,null,"2017-07-23","17/18","16/17","15/16",null,"2017-07-23","N/A","N/A","15/16"]
[null,null,null,null,null,null,null,"2017-07-24","17/18","16/17","15/16",null,"2017-07-24","N/A","N/A","15/16"]
[null,null,null,null,null,null,null,"2017-07-25","17/18","16/17","15/16",null,"2017-07-25","N/A","N/A","15/16"]
[null,null,null,null,null,null,null,"2017-07-26","17/18","16/17","15/16",null,"2017-07-26","N/A","N/A","15/16"]
[null,null,null,null,null,null,null,"2017-07-27","17/18","16/17","15/16",null,"2017-07-27","N/A","N/A","15/16"]
[null,null,null,null,null,null,null,"2017-07-28","17/18","16/17","15/16",null,"2017-07-28","N/A","N/A","15/16"]
[null,null,null,null,null,null,null,"2017-07-29","17/18","16/17","15/16",null,"2017-07-29","N/A","N/A","15/16"]
[null,null,null,null,null,null,null,"2017-07-30","17/18","16/17","15/16",null,"2017-07-30","N/A","N/A","15/16"]
[null,null,null,null,null,null,null,"2017-07-31","17/18","16/17","15/16",null,"2017-07-31","N/A","N/A","15/16"]
[null,null,null,null,null,null,null,"2017-08-01","17/18","16/17","15/16",null,"2017-08-01","N/A","N/A","15/16"]
[null,null,null,null,null,null,null,"2017-08-02","17/18","16/17","15/16",null,"2017-08-02","N/A","N/A","15/16"]
[null,null,null,null,null,null,null,"2017-08-03","17/18","16/17","15/16",null,"2017-08-03","N/A","N/A","15/16"]
[null,null,null,null,null,null,null,"2017-08-04","17/18","16/17","15/16",null,"2017-08-04","N/A","N/A","15/16"]
[null,null,null,null,null,null,null,"2017-08-05","17/18","16/17","15/16",null,"2017-08-05","N/A","N/A","15/16"]
[null,null,null,null,null,null,null,"2017-08-06","17/18","16/17","15/16",null,"2017-08-06","N/A","N/A","15/16"]
[null,null,null,null,null,null,null,"2017-08-07","17/18","16/17","15/16",null,"2017-08-07","N/A","N/A","15/16"]
[null,null,null,null,null,null,null,"2017-08-08","17/18","16/17","15/16",null,"2017-08-08","N/A","N/A","15/16"]
[null,null,null,null,null,null,null,"2017-08-09","17/18","16/17","15/16",null,"2017-08-09","N/A","N/A","15/16"]
[null,null,null,null,null,null,null,"2017-08-10","17/18","16/17","15/16",null,"2017-08-10","N/A","N/A","15/16"]
[null,null,null,null,null,null,null,"2017-08-11","17/18","16/17","15/16",null,"2017-08-11","N/A","N/A","15/16"]
[null,null,null,null,null,null,null,"2017-08-12","17/18","16/17","15/16",null,"2017-08-12","N/A","N/A","15/16"]
[null,null,null,null,null,null,null,"2017-08-13","17/18","16/17","15/16",null,"2017-08-13","N/A","N/A","15/16"]
[null,null,null,null,null,null,null,"2017-08-14","17/18","16/17","15/16",null,"2017-08-14","N/A","N/A","15/16"]
[null,null,null,null,null,null,null,"2017-08-15","17/18","16/17","15/16",null,"2017-08-15","N/A","N/A","15/16"]
[null,null,null,null,null,null,null,"2017-08-16","17/18","16/17","15/16",null,"2017-08-16","N/A","N/A","15/16"]
[null,null,null,null,null,null,null,"2017-08-17","17/18","16/17","15/16",null,"2017-08-17","N/A","N/A","15/16"]
[null,null,null,null,null,null,null,"2017-08-18","17/18","16/17","15/16",null,"2017-08-18","N/A","N/A","15/16"]
[null,null,null,null,null,null,null,"2017-08-19","17/18","16/17","15/16",null,"2017-08-19","N/A","N/A","15/16"]
[null,null,null,null,null,null,null,"2017-08-20","17/18","16/17","15/16",null,"2017-08-20","N/A","N/A","15/16"]
[null,null,null,null,null,null,null,"2017-08-21","17/18","16/17","15/16",null,"2017-08-21","N/A","N/A","15/16"]
[null,null,null,null,null,null,null,"2017-08-22","17/18","16/17","15/16",null,"2017-08-22","N/A","N/A","15/16"]
[null,null,null,null,null,null,null,"2017-08-23","17/18","16/17","15/16",null,"2017-08-23","N/A","N/A","15/16"]
[null,null,null,null,null,null,null,"2017-08-24","17/18","16/17","15/16",null,"2017-08-24","N/A","N/A","15/16"]
[null,null,null,null,null,null,null,"2017-08-25","17/18","16/17","15/16",null,"2017-08-25","N/A","N/A","15/16"]
[null,null,null,null,null,null,null,"2017-08-26","17/18","16/17","15/16",null,"2017-08-26","N/A","N/A","15/16"]
[null,null,null,null,null,null,null,"2017-08-27","17/18","16/17","15/16",null,"2017-08-27","N/A","N/A","15/16"]
[null,null,null,null,null,null,null,"2017-08-28","17/18","16/17","15/16",null,"2017-08-28","N/A","N/A","15/16"]
[null,null,null,null,null,null,null,"2017-08-29","17/18","16/17","15/16",null,"2017-08-29","N/A","N/A","15/16"]
[null,null,null,null,null,null,null,"2017-08-30","17/18","16/17","15/16",null,"2017-08-30","N/A","N/A","15/16"]
[null,null,null,null,null,null,null,"2017-08-31","17/18","16/17","15/16",null,"2017-08-31","N/A","N/A","15/16"]
[null,null,null,null,null,null,null,"2017-09-01","17/18","16/17","15/16",null,"2017-09-01","N/A","N/A","15/16"]
[null,null,null,null,null,null,null,"2017-09-02","17/18","16/17","15/16",null,"2017-09-02","N/A","N/A","15/16"]
[null,null,null,null,null,null,null,"2017-09-03","17/18","16/17","15/16",null,"2017-09-03","N/A","N/A","15/16"]
[null,null,null,null,null,null,null,"2017-09-04","17/18","16/17","15/16",null,"2017-09-04","N/A","N/A","15/16"]
[null,null,null,null,null,null,null,"2017-09-05","17/18","16/17","15/16",null,"2017-09-05","N/A","N/A","15/16"]
[null,null,null,null,null,null,null,"2017-09-06","17/18","16/17","15/16",null,"2017-09-06","N/A","N/A","15/16"]
[null,null,null,null,null,null,null,"2017-09-07","17/18","16/17","15/16",null,"2017-09-07","N/A","N/A","15/16"]
[null,null,null,null,null,null,null,"2017-09-08","17/18","16/17","15/16",null,"2017-09-08","N/A","N/A","15/16"]
[null,null,null,null,null,null,null,"2017-09-09","17/18","16/17","15/16",null,"2017-09-09","N/A","N/A","15/16"]
[null,null,null,null,null,null,null,"2017-09-10","17/18","16/17","15/16",null,"2017-09-10","N/A","N/A","15/16"]
[null,null,null,null,null,null,null,"2017-09-11","17/18","16/17","15/16",null,"2017-09-11","N/A","N/A","15/16"]
[null,null,null,null,null,null,null,"2017-09-12","17/18","16/17","15/16",null,"2017-09-12","N/A","N/A","15/16"]
[null,null,null,null,null,null,null,"2017-09-13","17/18","16/17","15/16",null,"2017-09-13","N/A","N/A","15/16"]
[null,null,null,null,null,null,null,"2017-09-14","17/18","16/17","15/16",null,"2017-09-14","N/A","N/A","15/16"]
[null,null,null,null,null,null,null,"2017-09-15","17/18","16/17","15/16",null,"2017-09-15","N/A","N/A","15/16"]
[null,null,null,null,null,null,null,"2017-09-16","17/18","16/17","15/16",null,"2017-09-16","N/A","N/A","15/16"]
[null,null,null,null,null,null,null,"2017-09-17","17/18","16/17","15/16",null,"2017-09-17","N/A","N/A","15/16"]
[null,null,null,null,null,null,null,"2017-09-18","17/18","16/17","15/16",null,"2017-09-18","N/A","N/A","15/16"]
[null,null,null,null,null,null,null,"2017-09-19","17/18","16/17","15/16",null,"2017-09-19","N/A","N/A","15/16"]
[null,null,null,null,null,null,null,"2017-09-20","17/18","16/17","15/16",null,"2017-09-20","N/A","N/A","15/16"]
[null,null,null,null,null,null,null,"2017-09-21","17/18","16/17","15/16",null,"2017-09-21","N/A","N/A","15/16"]
[null,null,null,null,null,null,null,"2017-09-22","17/18","16/17","15/16",null,"2017-09-22","N/A","N/A","15/16"]
[null,null,null,null,null,null,null,"2017-09-23","17/18","16/17","15/16",null,"2017-09-23","N/A","N/A","15/16"]
[null,null,null,null,null,null,null,"2017-09-24","17/18","16/17","15/16",null,"2017-09-24","N/A","N/A","15/16"]
[null,null,null,null,null,null,null,"2017-09-25","17/18","16/17","15/16",null,"2017-09-25","N/A","N/A","15/16"]
[null,null,null,null,null,null,null,"2017-09-26","17/18","16/17","15/16",null,"2017-09-26","N/A","N/A","15/16"]
[null,null,null,null,null,null,null,"2017-09-27","17/18","16/17","15/16",null,"2017-09-27","N/A","N/A","15/16"]
[null,null,null,null,null,null,null,"2017-09-28","17/18","16/17","15/16",null,"2017-09-28","N/A","N/A","15/16"]
[null,null,null,null,null,null,null,"2017-09-29","17/18","16/17","15/16",null,"2017-09-29","N/A","N/A","15/16"]
[null,null,null,null,null,null,null,"2017-09-30","17/18","16/17","15/16",null,"2017-09-30","N/A","N/A","15/16"]
[null,null,null,null,null,null,null,"2017-10-01","17/18","16/17","15/16",null,"2017-10-01","N/A","N/A","15/16"]
[null,null,null,null,null,null,null,"2017-10-02","17/18","16/17","15/16",null,"2017-10-02","N/A","N/A","15/16"]
[null,null,null,null,null,null,null,"2017-10-03","17/18","16/17","15/16",null,"2017-10-03","N/A","N/A","15/16"]
[null,null,null,null,null,null,null,"2017-10-04","17/18","16/17","15/16",null,"2017-10-04","N/A","N/A","15/16"]
[null,null,null,null,null,null,null,"2017-10-05","17/18","16/17","15/16",null,"2017-10-05","N/A","N/A","15/16"]
[null,null,null,null,null,null,null,"2017-10-06","17/18","16/17","15/16",null,"2017-10-06","N/A","N/A","15/16"]
[null,null,null,null,null,null,null,"2017-10-07","17/18","16/17","15/16",null,"2017-10-07","N/A","N/A","15/16"]
[null,null,null,null,null,null,null,"2017-10-08","17/18","16/17","15/16",null,"2017-10-08","N/A","N/A","15/16"]
[null,null,null,null,null,null,null,"2017-10-09","17/18","16/17","15/16",null,"2017-10-09","N/A","N/A","15/16"]
[null,null,null,null,null,null,null,"2017-10-10","17/18","16/17","15/16",null,"2017-10-10","N/A","N/A","15/16"]
[null,null,null,null,null,null,null,"2017-10-11","17/18","16/17","15/16",null,"2017-10-11","N/A","N/A","15/16"]
[null,null,null,null,null,null,null,"2017-10-12","17/18","16/17","15/16",null,"2017-10-12","N/A","N/A","15/16"]
[null,null,null,null,null,null,null,"2017-10-13","17/18","16/17","15/16",null,"2017-10-13","N/A","N/A","15/16"]
[null,null,null,null,null,null,null,"2017-10-14","17/18","16/17","15/16",null,"2017-10-14","N/A","N/A","15/16"]
[null,null,null,null,null,null,null,"2017-10-15","17/18","16/17","15/16",null,"2017-10-15","N/A","N/A","15/16"]
[null,null,null,null,null,null,null,"2017-10-16","17/18","16/17","15/16",null,"2017-10-16","N/A","N/A","15/16"]
[null,null,null,null,null,null,null,"2017-10-17","17/18","16/17","15/16",null,"2017-10-17","N/A","N/A","15/16"]
[null,null,null,null,null,null,null,"2017-10-18","17/18","16/17","15/16",null,"2017-10-18","N/A","N/A","15/16"]
[null,null,null,null,null,null,null,"2017-10-19","17/18","16/17","15/16",null,"2017-10-19","N/A","N/A","15/16"]
[null,null,null,null,null,null,null,"2017-10-20","17/18","16/17","15/16",null,"2017-10-20","N/A","N/A","15/16"]
[null,null,null,null,null,null,null,"2017-10-21","17/18","16/17","15/16",null,"2017-10-21","N/A","N/A","15/16"]
[null,null,null,null,null,null,null,"2017-10-22","17/18","16/17","15/16",null,"2017-10-22","N/A","N/A","15/16"]
[null,null,null,null,null,null,null,"2017-10-23","17/18","16/17","15/16",null,"2017-10-23","N/A","N/A","15/16"]
[null,null,null,null,null,null,null,"2017-10-24","17/18","16/17","15/16",null,"2017-10-24","N/A","N/A","15/16"]
[null,null,null,null,null,null,null,"2017-10-25","17/18","16/17","15/16",null,"2017-10-25","N/A","N/A","15/16"]
[null,null,null,null,null,null,null,"2017-10-26","17/18","16/17","15/16",null,"2017-10-26","N/A","N/A","15/16"]
[null,null,null,null,null,null,null,"2017-10-27","17/18","16/17","15/16",null,"2017-10-27","N/A","N/A","15/16"]
[null,null,null,null,null,null,null,"2017-10-28","17/18","16/17","15/16",null,"2017-10-28","N/A","N/A","15/16"]
[null,null,null,null,null,null,null,"2017-10-29","17/18","16/17","15/16",null,"2017-10-29","N/A","N/A","15/16"]
[null,null,null,null,null,null,null,"2017-10-30","17/18","16/17","15/16",null,"2017-10-30","N/A","N/A","15/16"]
[null,null,null,null,null,null,null,"2017-10-31","17/18","16/17","15/16",null,"2017-10-31","N/A","N/A","15/16"]
[null,null,null,null,null,null,null,"2017-11-01","17/18","16/17","15/16",null,"2017-11-01","N/A","N/A","15/16"]
[null,null,null,null,null,null,null,"2017-11-02","17/18","16/17","15/16",null,"2017-11-02","N/A","N/A","15/16"]
[null,null,null,null,null,null,null,"2017-11-03","17/18","16/17","15/16",null,"2017-11-03","N/A","N/A","15/16"]
[null,null,null,null,null,null,null,"2017-11-04","17/18","16/17","15/16",null,"2017-11-04","N/A","N/A","15/16"]
[null,null,null,null,null,null,null,"2017-11-05","17/18","16/17","15/16",null,"2017-11-05","N/A","N/A","15/16"]
[null,null,null,null,null,null,null,"2017-11-06","17/18","16/17","15/16",null,"2017-11-06","N/A","N/A","15/16"]
[null,null,null,null,null,null,null,"2017-11-07","17/18","16/17","15/16",null,"2017-11-07","N/A","N/A","15/16"]
[null,null,null,null,null,null,null,"2017-11-08","17/18","16/17","15/16",null,"2017-11-08","N/A","N/A","15/16"]
[null,null,null,null,null,null,null,"2017-11-09","17/18","16/17","15/16",null,"2017-11-09","N/A","N/A","15/16"]
[null,null,null,null,null,null,null,"2017-11-10","17/18","16/17","15/16",null,"2017-11-10","N/A","N/A","15/16"]
[null,null,null,null,null,null,null,"2017-11-11","17/18","16/17","15/16",null,"2017-11-11","N/A","N/A","15/16"]
[null,null,null,null,null,null,null,"2017-11-12","17/18","16/17","15/16",null,"2017-11-12","N/A","N/A","15/16"]
[null,null,null,null,null,null,null,"2017-11-13","17/18","16/17","15/16",null,"2017-11-13","N/A","N/A","15/16"]
[null,null,null,null,null,null,null,"2017-11-14","17/18","16/17","15/16",null,"2017-11-14","N/A","N/A","15/16"]
[null,null,null,null,null,null,null,"2017-11-15","17/18","16/17","15/16",null,"2017-11-15","N/A","N/A","15/16"]
[null,null,null,null,null,null,null,"2017-11-16","17/18","16/17","15/16",null,"2017-11-16","N/A","N/A","15/16"]
[null,null,null,null,null,null,null,"2017-11-17","17/18","16/17","15/16",null,"2017-11-17","N/A","N/A","15/16"]
[null,null,null,null,null,null,null,"2017-11-18","17/18","16/17","15/16",null,"2017-11-18","N/A","N/A","15/16"]
[null,null,null,null,null,null,null,"2017-11-19","17/18","16/17","15/16",null,"2017-11-19","N/A","N/A","15/16"]
[null,null,null,null,null,null,null,"2017-11-20","17/18","16/17","15/16",null,"2017-11-20","N/A","N/A","15/16"]
[null,null,null,null,null,null,null,"2017-11-21","17/18","16/17","15/16",null,"2017-11-21","N/A","N/A","15/16"]
[null,null,null,null,null,null,null,"2017-11-22","17/18","16/17","15/16",null,"2017-11-22","N/A","N/A","15/16"]
[null,null,null,null,null,null,null,"2017-11-23","17/18","16/17","15/16",null,"2017-11-23","N/A","N/A","15/16"]
[null,null,null,null,null,null,null,"2017-11-24","17/18","16/17","15/16",null,"2017-11-24","N/A","N/A","15/16"]
[null,null,null,null,null,null,null,"2017-11-25","17/18","16/17","15/16",null,"2017-11-25","N/A","N/A","15/16"]
[null,null,null,null,null,null,null,"2017-11-26","17/18","16/17","15/16",null,"2017-11-26","N/A","N/A","15/16"]
[null,null,null,null,null,null,null,"2017-11-27","17/18","16/17","15/16",null,"2017-11-27","N/A","N/A","15/16"]
[null,null,null,null,null,null,null,"2017-11-28","17/18","16/17","15/16",null,"2017-11-28","N/A","N/A","15/16"]
[null,null,null,null,null,null,null,"2017-11-29","17/18","16/17","15/16",null,"2017-11-29","N/A","N/A","15/16"]
[null,null,null,null,null,null,null,"2017-11-30","17/18","16/17","15/16",null,"2017-11-30","N/A","N/A","15/16"]
[null,null,null,null,null,null,null,"2017-12-01","17/18","16/17","15/16",null,"2017-12-01","N/A","N/A","15/16"]
[null,null,null,null,null,null,null,"2017-12-02","17/18","16/17","15/16",null,"2017-12-02","N/A","N/A","15/16"]
[null,null,null,null,null,null,null,"2017-12-03","17/18","16/17","15/16",null,"2017-12-03","N/A","N/A","15/16"]
[null,null,null,null,null,null,null,"2017-12-04","17/18","16/17","15/16",null,"2017-12-04","N/A","N/A","15/16"]
[null,null,null,null,null,null,null,"2017-12-05","17/18","16/17","15/16",null,"2017-12-05","N/A","N/A","15/16"]
[null,null,null,null,null,null,null,"2017-12-06","17/18","16/17","15/16",null,"2017-12-06","N/A","N/A","15/16"]
[null,null,null,null,null,null,null,"2017-12-07","17/18","16/17","15/16",null,"2017-12-07","N/A","N/A","15/16"]
[null,null,null,null,null,null,null,"2017-12-08","17/18","16/17","15/16",null,"2017-12-08","N/A","N/A","15/16"]
[null,null,null,null,null,null,null,"2017-12-09","17/18","16/17","15/16",null,"2017-12-09","N/A","N/A","15/16"]
[null,null,null,null,null,null,null,"2017-12-10","17/18","16/17","15/16",null,"2017-12-10","N/A","N/A","15/16"]
[null,null,null,null,null,null,null,"2017-12-11","17/18","16/17","15/16",null,"2017-12-11","N/A","N/A","15/16"]
[null,null,null,null,null,null,null,"2017-12-12","17/18","16/17","15/16",null,"2017-12-12","N/A","N/A","15/16"]
[null,null,null,null,null,null,null,"2017-12-13","17/18","16/17","15/16",null,"2017-12-13","N/A","N/A","15/16"]
[null,null,null,null,null,null,null,"2017-12-14","17/18","16/17","15/16",null,"2017-12-14","N/A","N/A","15/16"]
[null,null,null,null,null,null,null,"2017-12-15","17/18","16/17","15/16",null,"2017-12-15","N/A","N/A","15/16"]
[null,null,null,null,null,null,null,"2017-12-16","17/18","16/17","15/16",null,"2017-12-16","N/A","N/A","15/16"]
[null,null,null,null,null,null,null,"2017-12-17","17/18","16/17","15/16",null,"2017-12-17","N/A","N/A","15/16"]
[null,null,null,null,null,null,null,"2017-12-18","17/18","16/17","15/16",null,"2017-12-18","N/A","N/A","15/16"]
[null,null,null,null,null,null,null,"2017-12-19","17/18","16/17","15/16",null,"2017-12-19","N/A","N/A","15/16"]
[null,null,null,null,null,null,null,"2017-12-20","17/18","16/17","15/16",null,"2017-12-20","N/A","N/A","15/16"]
[null,null,null,null,null,null,null,"2017-12-21","17/18","16/17","15/16",null,"2017-12-21","N/A","N/A","15/16"]
[null,null,null,null,null,null,null,"2017-12-22","17/18","16/17","15/16",null,"2017-12-22","N/A","N/A","15/16"]
[null,null,null,null,null,null,null,"2017-12-23","17/18","16/17","15/16",null,"2017-12-23","N/A","N/A","15/16"]
[null,null,null,null,null,null,null,"2017-12-24","17/18","16/17","15/16",null,"2017-12-24","N/A","N/A","15/16"]
[null,null,null,null,null,null,null,"2017-12-25","17/18","16/17","15/16",null,"2017-12-25","N/A","N/A","15/16"]
[null,null,null,null,null,null,null,"2017-12-26","17/18","16/17","15/16",null,"2017-12-26","N/A","N/A","15/16"]
[null,null,null,null,null,null,null,"2017-12-27","17/18","16/17","15/16",null,"2017-12-27","N/A","N/A","15/16"]
[null,null,null,null,null,null,null,"2017-12-28","17/18","16/17","15/16",null,"2017-12-28","N/A","N/A","15/16"]
[null,null,null,null,null,null,null,"2017-12-29","17/18","16/17","15/16",null,"2017-12-29","N/A","N/A","15/16"]
[null,null,null,null,null,null,null,"2017-12-30","17/18","16/17","15/16",null,"2017-12-30","N/A","N/A","15/16"]
[null,null,null,null,null,null,null,"2017-12-31","17/18","16/17","15/16",null,"2017-12-31","N/A","N/A","15/16"]
[null,null,null,null,null,null,null,"2018-01-01","17/18","16/17","15/16",null,"2018-01-01","N/A","N/A","15/16"]
[null,null,null,null,null,null,null,"2018-01-02","17/18","16/17","15/16",null,"2018-01-02","N/A","N/A","15/16"]
[null,null,null,null,null,null,null,"2018-01-03","17/18","16/17","15/16",null,"2018-01-03","N/A","N/A","15/16"]
[null,null,null,null,null,null,null,"2018-01-04","17/18","16/17","15/16",null,"2018-01-04","N/A","N/A","15/16"]
[null,null,null,null,null,null,null,"2018-01-05","17/18","16/17","15/16",null,"2018-01-05","N/A","N/A","15/16"]
[null,null,null,null,null,null,null,"2018-01-06","17/18","16/17","15/16",null,"2018-01-06","N/A","N/A","15/16"]
[null,null,null,null,null,null,null,"2018-01-07","17/18","16/17","15/16",null,"2018-01-07","N/A","N/A","15/16"]
[null,null,null,null,null,null,null,"2018-01-08","17/18","16/17","15/16",null,"2018-01-08","N/A","N/A","15/16"]
[null,null,null,null,null,null,null,"2018-01-09","17/18","16/17","15/16",null,"2018-01-09","N/A","N/A","15/16"]
[null,null,null,null,null,null,null,"2018-01-10","17/18","16/17","15/16",null,"2018-01-10","N/A","N/A","15/16"]
[null,null,null,null,null,null,null,"2018-01-11","17/18","16/17","15/16",null,"2018-01-11","N/A","N/A","15/16"]
[null,null,null,null,null,null,null,"2018-01-12","17/18","16/17","15/16",null,"2018-01-12","N/A","N/A","15/16"]
[null,null,null,null,null,null,null,"2018-01-13","17/18","16/17","15/16",null,"2018-01-13","N/A","N/A","15/16"]
[null,null,null,null,null,null,null,"2018-01-14","17/18","16/17","15/16",null,"2018-01-14","N/A","N/A","15/16"]
[null,null,null,null,null,null,null,"2018-01-15","17/18","16/17","15/16",null,"2018-01-15","N/A","N/A","15/16"]
[null,null,null,null,null,null,null,"2018-01-16","17/18","16/17","15/16",null,"2018-01-16","N/A","N/A","15/16"]
[null,null,null,null,null,null,null,"2018-01-17","17/18","16/17","15/16",null,"2018-01-17","N/A","N/A","15/16"]
[null,null,null,null,null,null,null,"2018-01-18","17/18","16/17","15/16",null,"2018-01-18","N/A","N/A","15/16"]
[null,null,null,null,null,null,null,"2018-01-19","17/18","16/17","15/16",null,"2018-01-19","N/A","N/A","15/16"]
[null,null,null,null,null,null,null,"2018-01-20","17/18","16/17","15/16",null,"2018-01-20","N/A","N/A","15/16"]
[null,null,null,null,null,null,null,"2018-01-21","17/18","16/17","15/16",null,"2018-01-21","N/A","N/A","15/16"]
[null,null,null,null,null,null,null,"2018-01-22","17/18","16/17","15/16",null,"2018-01-22","N/A","N/A","15/16"]
[null,null,null,null,null,null,null,"2018-01-23","17/18","16/17","15/16",null,"2018-01-23","N/A","N/A","15/16"]
[null,null,null,null,null,null,null,"2018-01-24","17/18","16/17","15/16",null,"2018-01-24","N/A","N/A","15/16"]
[null,null,null,null,null,null,null,"2018-01-25","17/18","16/17","15/16",null,"2018-01-25","N/A","N/A","15/16"]
[null,null,null,null,null,null,null,"2018-01-26","17/18","16/17","15/16",null,"2018-01-26","N/A","N/A","15/16"]
[null,null,null,null,null,null,null,"2018-01-27","17/18","16/17","15/16",null,"2018-01-27","N/A","N/A","15/16"]
[null,null,null,null,null,null,null,"2018-01-28","17/18","16/17","15/16",null,"2018-01-28","N/A","N/A","15/16"]
[null,null,null,null,null,null,null,"2018-01-29","17/18","16/17","15/16",null,"2018-01-29","N/A","N/A","15/16"]
[null,null,null,null,null,null,null,"2018-01-30","17/18","16/17","15/16",null,"2018-01-30","N/A","N/A","15/16"]
[null,null,null,null,null,null,null,"2018-01-31","17/18","16/17","15/16",null,"2018-01-31","N/A","N/A","15/16"]
[null,null,null,null,null,null,null,"2018-02-01","17/18","16/17","15/16",null,"2018-02-01","N/A","N/A","15/16"]
[null,null,null,null,null,null,null,"2018-02-02","17/18","16/17","15/16",null,"2018-02-02","N/A","N/A","15/16"]
[null,null,null,null,null,null,null,"2018-02-03","17/18","16/17","15/16",null,"2018-02-03","N/A","N/A","15/16"]
[null,null,null,null,null,null,null,"2018-02-04","17/18","16/17","15/16",null,"2018-02-04","N/A","N/A","15/16"]
[null,null,null,null,null,null,null,"2018-02-05","17/18","16/17","15/16",null,"2018-02-05","N/A","N/A","15/16"]
[null,null,null,null,null,null,null,"2018-02-06","17/18","16/17","15/16",null,"2018-02-06","N/A","N/A","15/16"]
[null,null,null,null,null,null,null,"2018-02-07","17/18","16/17","15/16",null,"2018-02-07","N/A","N/A","15/16"]
[null,null,null,null,null,null,null,"2018-02-08","17/18","16/17","15/16",null,"2018-02-08","N/A","N/A","15/16"]
[null,null,null,null,null,null,null,"2018-02-09","17/18","16/17","15/16",null,"2018-02-09","N/A","N/A","15/16"]
[null,null,null,null,null,null,null,"2018-02-10","17/18","16/17","15/16",null,"2018-02-10","N/A","N/A","15/16"]
[null,null,null,null,null,null,null,"2018-02-11","17/18","16/17","15/16",null,"2018-02-11","N/A","N/A","15/16"]
[null,null,null,null,null,null,null,"2018-02-12","17/18","16/17","15/16",null,"2018-02-12","N/A","N/A","15/16"]
[null,null,null,null,null,null,null,"2018-02-13","17/18","16/17","15/16",null,"2018-02-13","N/A","N/A","15/16"]
[null,null,null,null,null,null,null,"2018-02-14","17/18","16/17","15/16",null,"2018-02-14","N/A","N/A","15/16"]
[null,null,null,null,null,null,null,"2018-02-15","17/18","16/17","15/16",null,"2018-02-15","N/A","N/A","15/16"]
[null,null,null,null,null,null,null,"2018-02-16","17/18","16/17","15/16",null,"2018-02-16","N/A","N/A","15/16"]
[null,null,null,null,null,null,null,"2018-02-17","17/18","16/17","15/16",null,"2018-02-17","N/A","N/A","15/16"]
[null,null,null,null,null,null,null,"2018-02-18","17/18","16/17","15/16",null,"2018-02-18","N/A","N/A","15/16"]
[null,null,null,null,null,null,null,"2018-02-19","17/18","16/17","15/16",null,"2018-02-19","N/A","N/A","15/16"]
[null,null,null,null,null,null,null,"2018-02-20","17/18","16/17","15/16",null,"2018-02-20","N/A","N/A","15/16"]
[null,null,null,null,null,null,null,"2018-02-21","17/18","16/17","15/16",null,"2018-02-21","N/A","N/A","15/16"]
[null,null,null,null,null,null,null,"2018-02-22","17/18","16/17","15/16",null,"2018-02-22","N/A","N/A","15/16"]
[null,null,null,null,null,null,null,"2018-02-23","17/18","16/17","15/16",null,"2018-02-23","N/A","N/A","15/16"]
[null,null,null,null,null,null,null,"2018-02-24","17/18","16/17","15/16",null,"2018-02-24","N/A","N/A","15/16"]
[null,null,null,null,null,null,null,"2018-02-25","17/18","16/17","15/16",null,"2018-02-25","N/A","N/A","15/16"]
[null,null,null,null,null,null,null,"2018-02-26","17/18","16/17","15/16",null,"2018-02-26","N/A","N/A","15/16"]
[null,null,null,null,null,null,null,"2018-02-27","17/18","16/17","15/16",null,"2018-02-27","N/A","N/A","15/16"]
[null,null,null,null,null,null,null,"2018-02-28","17/18","16/17","15/16",null,"2018-02-28","N/A","N/A","15/16"]
[null,null,null,null,null,null,null,"2018-03-01","17/18","16/17","15/16",null,"2018-03-01","N/A","N/A","15/16"]
[null,null,null,null,null,null,null,"2018-03-02","17/18","16/17","15/16",null,"2018-03-02","N/A","N/A","15/16"]
[null,null,null,null,null,null,null,"2018-03-03","17/18","16/17","15/16",null,"2018-03-03","N/A","N/A","15/16"]
[null,null,null,null,null,null,null,"2018-03-04","17/18","16/17","15/16",null,"2018-03-04","N/A","N/A","15/16"]
[null,null,null,null,null,null,null,"2018-03-05","17/18","16/17","15/16",null,"2018-03-05","N/A","N/A","15/16"]
[null,null,null,null,null,null,null,"2018-03-06","17/18","16/17","15/16",null,"2018-03-06","N/A","N/A","15/16"]
[null,null,null,null,null,null,null,"2018-03-07","17/18","16/17","15/16",null,"2018-03-07","N/A","N/A","15/16"]
[null,null,null,null,null,null,null,"2018-03-08","17/18","16/17","15/16",null,"2018-03-08","N/A","N/A","15/16"]
[null,null,null,null,null,null,null,"2018-03-09","17/18","16/17","15/16",null,"2018-03-09","N/A","N/A","15/16"]
[null,null,null,null,null,null,null,"2018-03-10","17/18","16/17","15/16",null,"2018-03-10","N/A","N/A","15/16"]
[null,null,null,null,null,null,null,"2018-03-11","17/18","16/17","15/16",null,"2018-03-11","N/A","N/A","15/16"]
[null,null,null,null,null,null,null,"2018-03-12","17/18","16/17","15/16",null,"2018-03-12","N/A","N/A","15/16"]
[null,null,null,null,null,null,null,"2018-03-13","17/18","16/17","15/16",null,"2018-03-13","N/A","N/A","15/16"]
[null,null,null,null,null,null,null,"2018-03-14","17/18","16/17","15/16",null,"2018-03-14","N/A","N/A","15/16"]
[null,null,null,null,null,null,null,"2018-03-15","17/18","16/17","15/16",null,"2018-03-15","N/A","N/A","15/16"]
[null,null,null,null,null,null,null,"2018-03-16","17/18","16/17","15/16",null,"2018-03-16","N/A","N/A","15/16"]
[null,null,null,null,null,null,null,"2018-03-17","17/18","16/17","15/16",null,"2018-03-17","N/A","N/A","15/16"]
[null,null,null,null,null,null,null,"2018-03-18","17/18","16/17","15/16",null,"2018-03-18","N/A","N/A","15/16"]
[null,null,null,null,null,null,null,"2018-03-19","17/18","16/17","15/16",null,"2018-03-19","N/A","N/A","15/16"]
[null,null,null,null,null,null,null,"2018-03-20","17/18","16/17","15/16",null,"2018-03-20","N/A","N/A","15/16"]
[null,null,null,null,null,null,null,"2018-03-21","17/18","16/17","15/16",null,"2018-03-21","N/A","N/A","15/16"]
[null,null,null,null,null,null,null,"2018-03-22","17/18","16/17","15/16",null,"2018-03-22","N/A","N/A","15/16"]
[null,null,null,null,null,null,null,"2018-03-23","17/18","16/17","15/16",null,"2018-03-23","N/A","N/A","15/16"]
[null,null,null,null,null,null,null,"2018-03-24","17/18","16/17","15/16",null,"2018-03-24","N/A","N/A","15/16"]
[null,null,null,null,null,null,null,"2018-03-25","17/18","16/17","15/16",null,"2018-03-25","N/A","N/A","15/16"]
[null,null,null,null,null,null,null,"2018-03-26","17/18","16/17","15/16",null,"2018-03-26","N/A","N/A","15/16"]
[null,null,null,null,null,null,null,"2018-03-27","17/18","16/17","15/16",null,"2018-03-27","N/A","N/A","15/16"]
[null,null,null,null,null,null,null,"2018-03-28","17/18","16/17","15/16",null,"2018-03-28","N/A","N/A","15/16"]
[null,null,null,null,null,null,null,"2018-03-29","17/18","16/17","15/16",null,"2018-03-29","N/A","N/A","15/16"]
[null,null,null,null,null,null,null,"2018-03-30","17/18","16/17","15/16",null,"2018-03-30","N/A","N/A","15/16"]
[null,null,null,null,null,null,null,"2018-03-31","17/18","16/17","15/16",null,"2018-03-31","N/A","N/A","15/16"]
[null,null,null,null,null,null,null,"2018-04-01","17/18","16/17","15/16",null,"2018-04-01","N/A","N/A","15/16"]
[null,null,null,null,null,null,null,"2018-04-02","17/18","16/17","15/16",null,"2018-04-02","N/A","N/A","15/16"]
[null,null,null,null,null,null,null,"2018-04-03","17/18","16/17","15/16",null,"2018-04-03","N/A","N/A","15/16"]
[null,null,null,null,null,null,null,"2018-04-04","17/18","16/17","15/16",null,"2018-04-04","N/A","N/A","15/16"]
[null,null,null,null,null,null,null,"2018-04-05","17/18","16/17","15/16",null,"2018-04-05","N/A","N/A","15/16"]
[null,null,null,null,null,null,null,"2018-04-06","18/19","17/18","16/17",null,"2018-04-06","N/A","N/A","N/A"]
[null,null,null,null,null,null,null,"2018-04-07","18/19","17/18","16/17",null,"2018-04-07","N/A","N/A","N/A"]
[null,null,null,null,null,null,null,"2018-04-08","18/19","17/18","16/17",null,"2018-04-08","N/A","N/A","N/A"]
[null,null,null,null,null,null,null,"2018-04-09","18/19","17/18","16/17",null,"2018-04-09","N/A","N/A","N/A"]
[null,null,null,null,null,null,null,"2018-04-10","18/19","17/18","16/17",null,"2018-04-10","N/A","N/A","N/A"]
[null,null,null,null,null,null,null,"2018-04-11","18/19","17/18","16/17",null,"2018-04-11","N/A","N/A","N/A"]
[null,null,null,null,null,null,null,"2018-04-12","18/19","17/18","16/17",null,"2018-04-12","N/A","N/A","N/A"]
[null,null,null,null,null,null,null,"2018-04-13","18/19","17/18","16/17",null,"2018-04-13","N/A","N/A","N/A"]
[null,null,null,null,null,null,null,"2018-04-14","18/19","17/18","16/17",null,"2018-04-14","N/A","N/A","N/A"]
[null,null,null,null,null,null,null,"2018-04-15","18/19","17/18","16/17",null,"2018-04-15","N/A","N/A","N/A"]
[null,null,null,null,null,null,null,"2018-04-16","18/19","17/18","16/17",null,"2018-04-16","N/A","N/A","N/A"]
[null,null,null,null,null,null,null,"2018-04-17","18/19","17/18","16/17",null,"2018-04-17","N/A","N/A","N/A"]
[null,null,null,null,null,null,null,"2018-04-18","18/19","17/18","16/17",null,"2018-04-18","N/A","N/A","N/A"]
[null,null,null,null,null,null,null,"2018-04-19","18/19","17/18","16/17",null,"2018-04-19","N/A","N/A","N/A"]
[null,null,null,null,null,null,null,"2018-04-20","18/19","17/18","16/17",null,"2018-04-20","N/A","N/A","N/A"]
[null,null,null,null,null,null,null,"2018-04-21","18/19","17/18","16/17",null,"2018-04-21","N/A","N/A","N/A"]
[null,null,null,null,null,null,null,"2018-04-22","18/19","17/18","16/17",null,"2018-04-22","N/A","N/A","N/A"]
[null,null,null,null,null,null,null,"2018-04-23","18/19","17/18","16/17",null,"2018-04-23","N/A","N/A","N/A"]
[null,null,null,null,null,null,null,"2018-04-24","18/19","17/18","16/17",null,"2018-04-24","N/A","N/A","N/A"]
[null,null,null,null,null,null,null,"2018-04-25","18/19","17/18","16/17",null,"2018-04-25","N/A","N/A","N/A"]
[null,null,null,null,null,null,null,"2018-04-26","18/19","17/18","16/17",null,"2018-04-26","N/A","N/A","N/A"]
[null,null,null,null,null,null,null,"2018-04-27","18/19","17/18","16/17",null,"2018-04-27","N/A","N/A","N/A"]
[null,null,null,null,null,null,null,"2018-04-28","18/19","17/18","16/17",null,"2018-04-28","N/A","N/A","N/A"]
[null,null,null,null,null,null,null,"2018-04-29","18/19","17/18","16/17",null,"2018-04-29","N/A","N/A","N/A"]
[null,null,null,null,null,null,null,"2018-04-30","18/19","17/18","16/17",null,"2018-04-30","N/A","N/A","N/A"]
[null,null,null,null,null,null,null,"2018-05-01","18/19","17/18","16/17",null,"2018-05-01","N/A","N/A","N/A"]
[null,null,null,null,null,null,null,"2018-05-02","18/19","17/18","16/17",null,"2018-05-02","N/A","N/A","N/A"]
[null,null,null,null,null,null,null,"2018-05-03","18/19","17/18","16/17",null,"2018-05-03","N/A","N/A","N/A"]
[null,null,null,null,null,null,null,"2018-05-04","18/19","17/18","16/17",null,"2018-05-04","N/A","N/A","N/A"]
[null,null,null,null,null,null,null,"2018-05-05","18/19","17/18","16/17",null,"2018-05-05","N/A","N/A","N/A"]
[null,null,null,null,null,null,null,"2018-05-06","18/19","17/18","16/17",null,"2018-05-06","N/A","N/A","N/A"]
[null,null,null,null,null,null,null,"2018-05-07","18/19","17/18","16/17",null,"2018-05-07","N/A","N/A","N/A"]
[null,null,null,null,null,null,null,"2018-05-08","18/19","17/18","16/17",null,"2018-05-08","N/A","N/A","N/A"]
[null,null,null,null,null,null,null,"2018-05-09","18/19","17/18","16/17",null,"2018-05-09","N/A","N/A","N/A"]
[null,null,null,null,null,null,null,"2018-05-10","18/19","17/18","16/17",null,"2018-05-10","N/A","N/A","N/A"]
[null,null,null,null,null,null,null,"2018-05-11","18/19","17/18","16/17",null,"2018-05-11","N/A","N/A","N/A"]
[null,null,null,null,null,null,null,"2018-05-12","18/19","17/18","16/17",null,"2018-05-12","N/A","N/A","N/A"]
[null,null,null,null,null,null,null,"2018-05-13","18/19","17/18","16/17",null,"2018-05-13","N/A","N/A","N/A"]
[null,null,null,null,null,null,null,"2018-05-14","18/19","17/18","16/17",null,"2018-05-14","N/A","N/A","N/A"]
[null,null,null,null,null,null,null,"2018-05-15","18/19","17/18","16/17",null,"2018-05-15","N/A","N/A","N/A"]
[null,null,null,null,null,null,null,"2018-05-16","18/19","17/18","16/17",null,"2018-05-16","N/A","N/A","N/A"]
[null,null,null,null,null,null,null,"2018-05-17","18/19","17/18","16/17",null,"2018-05-17","N/A","N/A","N/A"]
[null,null,null,null,null,null,null,"2018-05-18","18/19","17/18","16/17",null,"2018-05-18","N/A","N/A","N/A"]
[null,null,null,null,null,null,null,"2018-05-19","18/19","17/18","16/17",null,"2018-05-19","N/A","N/A","N/A"]
[null,null,null,null,null,null,null,"2018-05-20","18/19","17/18","16/17",null,"2018-05-20","N/A","N/A","N/A"]
[null,null,null,null,null,null,null,"2018-05-21","18/19","17/18","16/17",null,"2018-05-21","N/A","N/A","N/A"]
[null,null,null,null,null,null,null,"2018-05-22","18/19","17/18","16/17",null,"2018-05-22","N/A","N/A","N/A"]
[null,null,null,null,null,null,null,"2018-05-23","18/19","17/18","16/17",null,"2018-05-23","N/A","N/A","N/A"]
[null,null,null,null,null,null,null,"2018-05-24","18/19","17/18","16/17",null,"2018-05-24","N/A","N/A","N/A"]
[null,null,null,null,null,null,null,"2018-05-25","18/19","17/18","16/17",null,"2018-05-25","N/A","N/A","N/A"]
[null,null,null,null,null,null,null,"2018-05-26","18/19","17/18","16/17",null,"2018-05-26","N/A","N/A","N/A"]
[null,null,null,null,null,null,null,"2018-05-27","18/19","17/18","16/17",null,"2018-05-27","N/A","N/A","N/A"]
[null,null,null,null,null,null,null,"2018-05-28","18/19","17/18","16/17",null,"2018-05-28","N/A","N/A","N/A"]
[null,null,null,null,null,null,null,"2018-05-29","18/19","17/18","16/17",null,"2018-05-29","N/A","N/A","N/A"]
[null,null,null,null,null,null,null,"2018-05-30","18/19","17/18","16/17",null,"2018-05-30","N/A","N/A","N/A"]
[null,null,null,null,null,null,null,"2018-05-31","18/19","17/18","16/17",null,"2018-05-31","N/A","N/A","N/A"]
[null,null,null,null,null,null,null,"2018-06-01","18/19","17/18","16/17",null,"2018-06-01","N/A","N/A","N/A"]
[null,null,null,null,null,null,null,"2018-06-02","18/19","17/18","16/17",null,"2018-06-02","N/A","N/A","N/A"]
[null,null,null,null,null,null,null,"2018-06-03","18/19","17/18","16/17",null,"2018-06-03","N/A","N/A","N/A"]
[null,null,null,null,null,null,null,"2018-06-04","18/19","17/18","16/17",null,"2018-06-04","N/A","N/A","N/A"]
[null,null,null,null,null,null,null,"2018-06-05","18/19","17/18","16/17",null,"2018-06-05","N/A","N/A","N/A"]
[null,null,null,null,null,null,null,"2018-06-06","18/19","17/18","16/17",null,"2018-06-06","N/A","N/A","N/A"]
[null,null,null,null,null,null,null,"2018-06-07","18/19","17/18","16/17",null,"2018-06-07","N/A","N/A","N/A"]
[null,null,null,null,null,null,null,"2018-06-08","18/19","17/18","16/17",null,"2018-06-08","N/A","N/A","N/A"]
[null,null,null,null,null,null,null,"2018-06-09","18/19","17/18","16/17",null,"2018-06-09","N/A","N/A","N/A"]
[null,null,null,null,null,null,null,"2018-06-10","18/19","17/18","16/17",null,"2018-06-10","N/A","N/A","N/A"]
[null,null,null,null,null,null,null,"2018-06-11","18/19","17/18","16/17",null,"2018-06-11","N/A","N/A","N/A"]
[null,null,null,null,null,null,null,"2018-06-12","18/19","17/18","16/17",null,"2018-06-12","N/A","N/A","N/A"]
[null,null,null,null,null,null,null,"2018-06-13","18/19","17/18","16/17",null,"2018-06-13","N/A","N/A","N/A"]
[null,null,null,null,null,null,null,"2018-06-14","18/19","17/18","16/17",null,"2018-06-14","N/A","N/A","N/A"]
[null,null,null,null,null,null,null,"2018-06-15","18/19","17/18","16/17",null,"2018-06-15","N/A","N/A","N/A"]
[null,null,null,null,null,null,null,"2018-06-16","18/19","17/18","16/17",null,"2018-06-16","N/A","N/A","N/A"]
[null,null,null,null,null,null,null,"2018-06-17","18/19","17/18","16/17",null,"2018-06-17","N/A","N/A","N/A"]
[null,null,null,null,null,null,null,"2018-06-18","18/19","17/18","16/17",null,"2018-06-18","N/A","N/A","N/A"]
[null,null,null,null,null,null,null,"2018-06-19","18/19","17/18","16/17",null,"2018-06-19","N/A","N/A","N/A"]
[null,null,null,null,null,null,null,"2018-06-20","18/19","17/18","16/17",null,"2018-06-20","N/A","N/A","N/A"]
[null,null,null,null,null,null,null,"2018-06-21","18/19","17/18","16/17",null,"2018-06-21","N/A","N/A","N/A"]
[null,null,null,null,null,null,null,"2018-06-22","18/19","17/18","16/17",null,"2018-06-22","N/A","N/A","N/A"]
[null,null,null,null,null,null,null,"2018-06-23","18/19","17/18","16/17",null,"2018-06-23","N/A","N/A","N/A"]
[null,null,null,null,null,null,null,"2018-06-24","18/19","17/18","16/17",null,"2018-06-24","N/A","N/A","N/A"]
[null,null,null,null,null,null,null,"2018-06-25","18/19","17/18","16/17",null,"2018-06-25","N/A","N/A","N/A"]
[null,null,null,null,null,null,null,"2018-06-26","18/19","17/18","16/17",null,"2018-06-26","N/A","N/A","N/A"]
[null,null,null,null,null,null,null,"2018-06-27","18/19","17/18","16/17",null,"2018-06-27","N/A","N/A","N/A"]
[null,null,null,null,null,null,null,"2018-06-28","18/19","17/18","16/17",null,"2018-06-28","N/A","N/A","N/A"]
[null,null,null,null,null,null,null,"2018-06-29","18/19","17/18","16/17",null,"2018-06-29","N/A","N/A","N/A"]
[null,null,null,null,null,null,null,"2018-06-30","18/19","17/18","16/17",null,"2018-06-30","N/A","N/A","N/A"]
[null,null,null,null,null,null,null,"2018-07-01","18/19","17/18","16/17",null,"2018-07-01","N/A","N/A","N/A"]
[null,null,null,null,null,null,null,"2018-07-02","18/19","17/18","16/17",null,"2018-07-02","N/A","N/A","N/A"]
[null,null,null,null,null,null,null,"2018-07-03","18/19","17/18","16/17",null,"2018-07-03","N/A","N/A","N/A"]
[null,null,null,null,null,null,null,"2018-07-04","18/19","17/18","16/17",null,"2018-07-04","N/A","N/A","N/A"]
[null,null,null,null,null,null,null,"2018-07-05","18/19","17/18","16/17",null,"2018-07-05","N/A","N/A","N/A"]
[null,null,null,null,null,null,null,"2018-07-06","18/19","17/18","16/17",null,"2018-07-06","N/A","N/A","N/A"]
[null,null,null,null,null,null,null,"2018-07-07","18/19","17/18","16/17",null,"2018-07-07","N/A","N/A","N/A"]
[null,null,null,null,null,null,null,"2018-07-08","18/19","17/18","16/17",null,"2018-07-08","N/A","N/A","N/A"]
[null,null,null,null,null,null,null,"2018-07-09","18/19","17/18","16/17",null,"2018-07-09","N/A","N/A","N/A"]
[null,null,null,null,null,null,null,"2018-07-10","18/19","17/18","16/17",null,"2018-07-10","N/A","N/A","N/A"]
[null,null,null,null,null,null,null,"2018-07-11","18/19","17/18","16/17",null,"2018-07-11","N/A","N/A","N/A"]
[null,null,null,null,null,null,null,"2018-07-12","18/19","17/18","16/17",null,"2018-07-12","N/A","N/A","N/A"]
[null,null,null,null,null,null,null,"2018-07-13","18/19","17/18","16/17",null,"2018-07-13","N/A","N/A","N/A"]
[null,null,null,null,null,null,null,"2018-07-14","18/19","17/18","16/17",null,"2018-07-14","N/A","N/A","N/A"]
[null,null,null,null,null,null,null,"2018-07-15","18/19","17/18","16/17",null,"2018-07-15","N/A","N/A","N/A"]
[null,null,null,null,null,null,null,"2018-07-16","18/19","17/18","16/17",null,"2018-07-16","N/A","N/A","N/A"]
[null,null,null,null,null,null,null,"2018-07-17","18/19","17/18","16/17",null,"2018-07-17","N/A","N/A","N/A"]
[null,null,null,null,null,null,null,"2018-07-18","18/19","17/18","16/17",null,"2018-07-18","N/A","N/A","N/A"]
[null,null,null,null,null,null,null,"2018-07-19","18/19","17/18","16/17",null,"2018-07-19","N/A","N/A","N/A"]
[null,null,null,null,null,null,null,"2018-07-20","18/19","17/18","16/17",null,"2018-07-20","N/A","N/A","N/A"]
[null,null,null,null,null,null,null,"2018-07-21","18/19","17/18","16/17",null,"2018-07-21","N/A","N/A","N/A"]
[null,null,null,null,null,null,null,"2018-07-22","18/19","17/18","16/17",null,"2018-07-22","N/A","N/A","N/A"]
[null,null,null,null,null,null,null,"2018-07-23","18/19","17/18","16/17",null,"2018-07-23","N/A","N/A","N/A"]
[null,null,null,null,null,null,null,"2018-07-24","18/19","17/18","16/17",null,"2018-07-24","N/A","N/A","N/A"]
[null,null,null,null,null,null,null,"2018-07-25","18/19","17/18","16/17",null,"2018-07-25","N/A","N/A","N/A"]
[null,null,null,null,null,null,null,"2018-07-26","18/19","17/18","16/17",null,"2018-07-26","N/A","N/A","N/A"]
[null,null,null,null,null,null,null,"2018-07-27","18/19","17/18","16/17",null,"2018-07-27","N/A","N/A","N/A"]
[null,null,null,null,null,null,null,"2018-07-28","18/19","17/18","16/17",null,"2018-07-28","N/A","N/A","N/A"]
[null,null,null,null,null,null,null,"2018-07-29","18/19","17/18","16/17",null,"2018-07-29","N/A","N/A","N/A"]
[null,null,null,null,null,null,null,"2018-07-30","18/19","17/18","16/17",null,"2018-07-30","N/A","N/A","N/A"]
[null,null,null,null,null,null,null,"2018-07-31","18/19","17/18","16/17",null,"2018-07-31","N/A","N/A","N/A"]
[null,null,null,null,null,null,null,"2018-08-01","18/19","17/18","16/17",null,"2018-08-01","N/A","N/A","N/A"]
[null,null,null,null,null,null,null,"2018-08-02","18/19","17/18","16/17",null,"2018-08-02","N/A","N/A","N/A"]
[null,null,null,null,null,null,null,"2018-08-03","18/19","17/18","16/17",null,"2018-08-03","N/A","N/A","N/A"]
[null,null,null,null,null,null,null,"2018-08-04","18/19","17/18","16/17",null,"2018-08-04","N/A","N/A","N/A"]
[null,null,null,null,null,null,null,"2018-08-05","18/19","17/18","16/17",null,"2018-08-05","N/A","N/A","N/A"]
[null,null,null,null,null,null,null,"2018-08-06","18/19","17/18","16/17",null,"2018-08-06","N/A","N/A","N/A"]
[null,null,null,null,null,null,null,"2018-08-07","18/19","17/18","16/17",null,"2018-08-07","N/A","N/A","N/A"]
[null,null,null,null,null,null,null,"2018-08-08","18/19","17/18","16/17",null,"2018-08-08","N/A","N/A","N/A"]
[null,null,null,null,null,null,null,"2018-08-09","18/19","17/18","16/17",null,"2018-08-09","N/A","N/A","N/A"]
[null,null,null,null,null,null,null,"2018-08-10","18/19","17/18","16/17",null,"2018-08-10","N/A","N/A","N/A"]
[null,null,null,null,null,null,null,"2018-08-11","18/19","17/18","16/17",null,"2018-08-11","N/A","N/A","N/A"]
[null,null,null,null,null,null,null,"2018-08-12","18/19","17/18","16/17",null,"2018-08-12","N/A","N/A","N/A"]
[null,null,null,null,null,null,null,"2018-08-13","18/19","17/18","16/17",null,"2018-08-13","N/A","N/A","N/A"]
[null,null,null,null,null,null,null,"2018-08-14","18/19","17/18","16/17",null,"2018-08-14","N/A","N/A","N/A"]
[null,null,null,null,null,null,null,"2018-08-15","18/19","17/18","16/17",null,"2018-08-15","N/A","N/A","N/A"]
[null,null,null,null,null,null,null,"2018-08-16","18/19","17/18","16/17",null,"2018-08-16","N/A","N/A","N/A"]
[null,null,null,null,null,null,null,"2018-08-17","18/19","17/18","16/17",null,"2018-08-17","N/A","N/A","N/A"]
[null,null,null,null,null,null,null,"2018-08-18","18/19","17/18","16/17",null,"2018-08-18","N/A","N/A","N/A"]
[null,null,null,null,null,null,null,"2018-08-19","18/19","17/18","16/17",null,"2018-08-19","N/A","N/A","N/A"]
[null,null,null,null,null,null,null,"2018-08-20","18/19","17/18","16/17",null,"2018-08-20","N/A","N/A","N/A"]
[null,null,null,null,null,null,null,"2018-08-21","18/19","17/18","16/17",null,"2018-08-21","N/A","N/A","N/A"]
[null,null,null,null,null,null,null,"2018-08-22","18/19","17/18","16/17",null,"2018-08-22","N/A","N/A","N/A"]
[null,null,null,null,null,null,null,"2018-08-23","18/19","17/18","16/17",null,"2018-08-23","N/A","N/A","N/A"]
[null,null,null,null,null,null,null,"2018-08-24","18/19","17/18","16/17",null,"2018-08-24","N/A","N/A","N/A"]
[null,null,null,null,null,null,null,"2018-08-25","18/19","17/18","16/17",null,"2018-08-25","N/A","N/A","N/A"]
[null,null,null,null,null,null,null,"2018-08-26","18/19","17/18","16/17",null,"2018-08-26","N/A","N/A","N/A"]
[null,null,null,null,null,null,null,"2018-08-27","18/19","17/18","16/17",null,"2018-08-27","N/A","N/A","N/A"]
[null,null,null,null,null,null,null,"2018-08-28","18/19","17/18","16/17",null,"2018-08-28","N/A","N/A","N/A"]
[null,null,null,null,null,null,null,"2018-08-29","18/19","17/18","16/17",null,"2018-08-29","N/A","N/A","N/A"]
[null,null,null,null,null,null,null,"2018-08-30","18/19","17/18","16/17",null,"2018-08-30","N/A","N/A","N/A"]
[null,null,null,null,null,null,null,"2018-08-31","18/19","17/18","16/17",null,"2018-08-31","N/A","N/A","N/A"]
[null,null,null,null,null,null,null,"2018-09-01","18/19","17/18","16/17",null,"2018-09-01","N/A","N/A","N/A"]
[null,null,null,null,null,null,null,"2018-09-02","18/19","17/18","16/17",null,"2018-09-02","N/A","N/A","N/A"]
[null,null,null,null,null,null,null,"2018-09-03","18/19","17/18","16/17",null,"2018-09-03","N/A","N/A","N/A"]
[null,null,null,null,null,null,null,"2018-09-04","18/19","17/18","16/17",null,"2018-09-04","N/A","N/A","N/A"]
[null,null,null,null,null,null,null,"2018-09-05","18/19","17/18","16/17",null,"2018-09-05","N/A","N/A","N/A"]
[null,null,null,null,null,null,null,"2018-09-06","18/19","17/18","16/17",null,"2018-09-06","N/A","N/A","N/A"]
[null,null,null,null,null,null,null,"2018-09-07","18/19","17/18","16/17",null,"2018-09-07","N/A","N/A","N/A"]
[null,null,null,null,null,null,null,"2018-09-08","18/19","17/18","16/17",null,"2018-09-08","N/A","N/A","N/A"]
[null,null,null,null,null,null,null,"2018-09-09","18/19","17/18","16/17",null,"2018-09-09","N/A","N/A","N/A"]
[null,null,null,null,null,null,null,"2018-09-10","18/19","17/18","16/17",null,"2018-09-10","N/A","N/A","N/A"]
[null,null,null,null,null,null,null,"2018-09-11","18/19","17/18","16/17",null,"2018-09-11","N/A","N/A","N/A"]
[null,null,null,null,null,null,null,"2018-09-12","18/19","17/18","16/17",null,"2018-09-12","N/A","N/A","N/A"]
[null,null,null,null,null,null,null,"2018-09-13","18/19","17/18","16/17",null,"2018-09-13","N/A","N/A","N/A"]
[null,null,null,null,null,null,null,"2018-09-14","18/19","17/18","16/17",null,"2018-09-14","N/A","N/A","N/A"]
[null,null,null,null,null,null,null,"2018-09-15","18/19","17/18","16/17",null,"2018-09-15","N/A","N/A","N/A"]
[null,null,null,null,null,null,null,"2018-09-16","18/19","17/18","16/17",null,"2018-09-16","N/A","N/A","N/A"]
[null,null,null,null,null,null,null,"2018-09-17","18/19","17/18","16/17",null,"2018-09-17","N/A","N/A","N/A"]
[null,null,null,null,null,null,null,"2018-09-18","18/19","17/18","16/17",null,"2018-09-18","N/A","N/A","N/A"]
[null,null,null,null,null,null,null,"2018-09-19","18/19","17/18","16/17",null,"2018-09-19","N/A","N/A","N/A"]
[null,null,null,null,null,null,null,"2018-09-20","18/19","17/18","16/17",null,"2018-09-20","N/A","N/A","N/A"]
[null,null,null,null,null,null,null,"2018-09-21","18/19","17/18","16/17",null,"2018-09-21","N/A","N/A","N/A"]
[null,null,null,null,null,null,null,"2018-09-22","18/19","17/18","16/17",null,"2018-09-22","N/A","N/A","N/A"]
[null,null,null,null,null,null,null,"2018-09-23","18/19","17/18","16/17",null,"2018-09-23","N/A","N/A","N/A"]
[null,null,null,null,null,null,null,"2018-09-24","18/19","17/18","16/17",null,"2018-09-24","N/A","N/A","N/A"]
[null,null,null,null,null,null,null,"2018-09-25","18/19","17/18","16/17",null,"2018-09-25","N/A","N/A","N/A"]
[null,null,null,null,null,null,null,"2018-09-26","18/19","17/18","16/17",null,"2018-09-26","N/A","N/A","N/A"]
[null,null,null,null,null,null,null,"2018-09-27","18/19","17/18","16/17",null,"2018-09-27","N/A","N/A","N/A"]
[null,null,null,null,null,null,null,"2018-09-28","18/19","17/18","16/17",null,"2018-09-28","N/A","N/A","N/A"]
[null,null,null,null,null,null,null,"2018-09-29","18/19","17/18","16/17",null,"2018-09-29","N/A","N/A","N/A"]
[null,null,null,null,null,null,null,"2018-09-30","18/19","17/18","16/17",null,"2018-09-30","N/A","N/A","N/A"]
[null,null,null,null,null,null,null,"2018-10-01","18/19","17/18","16/17",null,"2018-10-01","N/A","N/A","N/A"]
[null,null,null,null,null,null,null,"2018-10-02","18/19","17/18","16/17",null,"2018-10-02","N/A","N/A","N/A"]
[null,null,null,null,null,null,null,"2018-10-03","18/19","17/18","16/17",null,"2018-10-03","N/A","N/A","N/A"]
[null,null,null,null,null,null,null,"2018-10-04","18/19","17/18","16/17",null,"2018-10-04","N/A","N/A","N/A"]
[null,null,null,null,null,null,null,"2018-10-05","18/19","17/18","16/17",null,"2018-10-05","N/A","N/A","N/A"]
[null,null,null,null,null,null,null,"2018-10-06","18/19","17/18","16/17",null,"2018-10-06","N/A","N/A","N/A"]
[null,null,null,null,null,null,null,"2018-10-07","18/19","17/18","16/17",null,"2018-10-07","N/A","N/A","N/A"]
[null,null,null,null,null,null,null,"2018-10-08","18/19","17/18","16/17",null,"2018-10-08","N/A","N/A","N/A"]
[null,null,null,null,null,null,null,"2018-10-09","18/19","17/18","16/17",null,"2018-10-09","N/A","N/A","N/A"]
[null,null,null,null,null,null,null,"2018-10-10","18/19","17/18","16/17",null,"2018-10-10","N/A","N/A","N/A"]
[null,null,null,null,null,null,null,"2018-10-11","18/19","17/18","16/17",null,"2018-10-11","N/A","N/A","N/A"]
[null,null,null,null,null,null,null,"2018-10-12","18/19","17/18","16/17",null,"2018-10-12","N/A","N/A","N/A"]
[null,null,null,null,null,null,null,"2018-10-13","18/19","17/18","16/17",null,"2018-10-13","N/A","N/A","N/A"]
[null,null,null,null,null,null,null,"2018-10-14","18/19","17/18","16/17",null,"2018-10-14","N/A","N/A","N/A"]
[null,null,null,null,null,null,null,"2018-10-15","18/19","17/18","16/17",null,"2018-10-15","N/A","N/A","N/A"]
[null,null,null,null,null,null,null,"2018-10-16","18/19","17/18","16/17",null,"2018-10-16","N/A","N/A","N/A"]
[null,null,null,null,null,null,null,"2018-10-17","18/19","17/18","16/17",null,"2018-10-17","N/A","N/A","N/A"]
[null,null,null,null,null,null,null,"2018-10-18","18/19","17/18","16/17",null,"2018-10-18","N/A","N/A","N/A"]
[null,null,null,null,null,null,null,"2018-10-19","18/19","17/18","16/17",null,"2018-10-19","N/A","N/A","N/A"]
[null,null,null,null,null,null,null,"2018-10-20","18/19","17/18","16/17",null,"2018-10-20","N/A","N/A","N/A"]
[null,null,null,null,null,null,null,"2018-10-21","18/19","17/18","16/17",null,"2018-10-21","N/A","N/A","N/A"]
[null,null,null,null,null,null,null,"2018-10-22","18/19","17/18","16/17",null,"2018-10-22","N/A","N/A","N/A"]
[null,null,null,null,null,null,null,"2018-10-23","18/19","17/18","16/17",null,"2018-10-23","N/A","N/A","N/A"]
[null,null,null,null,null,null,null,"2018-10-24","18/19","17/18","16/17",null,"2018-10-24","N/A","N/A","N/A"]
[null,null,null,null,null,null,null,"2018-10-25","18/19","17/18","16/17",null,"2018-10-25","N/A","N/A","N/A"]
[null,null,null,null,null,null,null,"2018-10-26","18/19","17/18","16/17",null,"2018-10-26","N/A","N/A","N/A"]
[null,null,null,null,null,null,null,"2018-10-27","18/19","17/18","16/17",null,"2018-10-27","N/A","N/A","N/A"]
[null,null,null,null,null,null,null,"2018-10-28","18/19","17/18","16/17",null,"2018-10-28","N/A","N/A","N/A"]
[null,null,null,null,null,null,null,"2018-10-29","18/19","17/18","16/17",null,"2018-10-29","N/A","N/A","N/A"]
[null,null,null,null,null,null,null,"2018-10-30","18/19","17/18","16/17",null,"2018-10-30","N/A","N/A","N/A"]
[null,null,null,null,null,null,null,"2018-10-31","18/19","17/18","16/17",null,"2018-10-31","N/A","N/A","N/A"]
[null,null,null,null,null,null,null,"2018-11-01","18/19","17/18","16/17",null,"2018-11-01","N/A","N/A","N/A"]
[null,null,null,null,null,null,null,"2018-11-02","18/19","17/18","16/17",null,"2018-11-02","N/A","N/A","N/A"]
[null,null,null,null,null,null,null,"2018-11-03","18/19","17/18","16/17",null,"2018-11-03","N/A","N/A","N/A"]
[null,null,null,null,null,null,null,"2018-11-04","18/19","17/18","16/17",null,"2018-11-04","N/A","N/A","N/A"]
[null,null,null,null,null,null,null,"2018-11-05","18/19","17/18","16/17",null,"2018-11-05","N/A","N/A","N/A"]
[null,null,null,null,null,null,null,"2018-11-06","18/19","17/18","16/17",null,"2018-11-06","N/A","N/A","N/A"]
[null,null,null,null,null,null,null,"2018-11-07","18/19","17/18","16/17",null,"2018-11-07","N/A","N/A","N/A"]
[null,null,null,null,null,null,null,"2018-11-08","18/19","17/18","16/17",null,"2018-11-08","N/A","N/A","N/A"]
[null,null,null,null,null,null,null,"2018-11-09","18/19","17/18","16/17",null,"2018-11-09","N/A","N/A","N/A"]
[null,null,null,null,null,null,null,"2018-11-10","18/19","17/18","16/17",null,"2018-11-10","N/A","N/A","N/A"]
[null,null,null,null,null,null,null,"2018-11-11","18/19","17/18","16/17",null,"2018-11-11","N/A","N/A","N/A"]
[null,null,null,null,null,null,null,"2018-11-12","18/19","17/18","16/17",null,"2018-11-12","N/A","N/A","N/A"]
[null,null,null,null,null,null,null,"2018-11-13","18/19","17/18","16/17",null,"2018-11-13","N/A","N/A","N/A"]
[null,null,null,null,null,null,null,"2018-11-14","18/19","17/18","16/17",null,"2018-11-14","N/A","N/A","N/A"]
[null,null,null,null,null,null,null,"2018-11-15","18/19","17/18","16/17",null,"2018-11-15","N/A","N/A","N/A"]
[null,null,null,null,null,null,null,"2018-11-16","18/19","17/18","16/17",null,"2018-11-16","N/A","N/A","N/A"]
[null,null,null,null,null,null,null,"2018-11-17","18/19","17/18","16/17",null,"2018-11-17","N/A","N/A","N/A"]
[null,null,null,null,null,null,null,"2018-11-18","18/19","17/18","16/17",null,"2018-11-18","N/A","N/A","N/A"]
[null,null,null,null,null,null,null,"2018-11-19","18/19","17/18","16/17",null,"2018-11-19","N/A","N/A","N/A"]
[null,null,null,null,null,null,null,"2018-11-20","18/19","17/18","16/17",null,"2018-11-20","N/A","N/A","N/A"]
[null,null,null,null,null,null,null,"2018-11-21","18/19","17/18","16/17",null,"2018-11-21","N/A","N/A","N/A"]
[null,null,null,null,null,null,null,"2018-11-22","18/19","17/18","16/17",null,"2018-11-22","N/A","N/A","N/A"]
[null,null,null,null,null,null,null,"2018-11-23","18/19","17/18","16/17",null,"2018-11-23","N/A","N/A","N/A"]
[null,null,null,null,null,null,null,"2018-11-24","18/19","17/18","16/17",null,"2018-11-24","N/A","N/A","N/A"]
[null,null,null,null,null,null,null,"2018-11-25","18/19","17/18","16/17",null,"2018-11-25","N/A","N/A","N/A"]
[null,null,null,null,null,null,null,"2018-11-26","18/19","17/18","16/17",null,"2018-11-26","N/A","N/A","N/A"]
[null,null,null,null,null,null,null,"2018-11-27","18/19","17/18","16/17",null,"2018-11-27","N/A","N/A","N/A"]
[null,null,null,null,null,null,null,"2018-11-28","18/19","17/18","16/17",null,"2018-11-28","N/A","N/A","N/A"]
[null,null,null,null,null,null,null,"2018-11-29","18/19","17/18","16/17",null,"2018-11-29","N/A","N/A","N/A"]
[null,null,null,null,null,null,null,"2018-11-30","18/19","17/18","16/17",null,"2018-11-30","N/A","N/A","N/A"]
[null,null,null,null,null,null,null,"2018-12-01","18/19","17/18","16/17",null,"2018-12-01","N/A","N/A","N/A"]
[null,null,null,null,null,null,null,"2018-12-02","18/19","17/18","16/17",null,"2018-12-02","N/A","N/A","N/A"]
[null,null,null,null,null,null,null,"2018-12-03","18/19","17/18","16/17",null,"2018-12-03","N/A","N/A","N/A"]
[null,null,null,null,null,null,null,"2018-12-04","18/19","17/18","16/17",null,"2018-12-04","N/A","N/A","N/A"]
[null,null,null,null,null,null,null,"2018-12-05","18/19","17/18","16/17",null,"2018-12-05","N/A","N/A","N/A"]
[null,null,null,null,null,null,null,"2018-12-06","18/19","17/18","16/17",null,"2018-12-06","N/A","N/A","N/A"]
[null,null,null,null,null,null,null,"2018-12-07","18/19","17/18","16/17",null,"2018-12-07","N/A","N/A","N/A"]
[null,null,null,null,null,null,null,"2018-12-08","18/19","17/18","16/17",null,"2018-12-08","N/A","N/A","N/A"]
[null,null,null,null,null,null,null,"2018-12-09","18/19","17/18","16/17",null,"2018-12-09","N/A","N/A","N/A"]
[null,null,null,null,null,null,null,"2018-12-10","18/19","17/18","16/17",null,"2018-12-10","N/A","N/A","N/A"]
[null,null,null,null,null,null,null,"2018-12-11","18/19","17/18","16/17",null,"2018-12-11","N/A","N/A","N/A"]
[null,null,null,null,null,null,null,"2018-12-12","18/19","17/18","16/17",null,"2018-12-12","N/A","N/A","N/A"]
[null,null,null,null,null,null,null,"2018-12-13","18/19","17/18","16/17",null,"2018-12-13","N/A","N/A","N/A"]
[null,null,null,null,null,null,null,"2018-12-14","18/19","17/18","16/17",null,"2018-12-14","N/A","N/A","N/A"]
[null,null,null,null,null,null,null,"2018-12-15","18/19","17/18","16/17",null,"2018-12-15","N/A","N/A","N/A"]
[null,null,null,null,null,null,null,"2018-12-16","18/19","17/18","16/17",null,"2018-12-16","N/A","N/A","N/A"]
[null,null,null,null,null,null,null,"2018-12-17","18/19","17/18","16/17",null,"2018-12-17","N/A","N/A","N/A"]
[null,null,null,null,null,null,null,"2018-12-18","18/19","17/18","16/17",null,"2018-12-18","N/A","N/A","N/A"]
[null,null,null,null,null,null,null,"2018-12-19","18/19","17/18","16/17",null,"2018-12-19","N/A","N/A","N/A"]
[null,null,null,null,null,null,null,"2018-12-20","18/19","17/18","16/17",null,"2018-12-20","N/A","N/A","N/A"]
[null,null,null,null,null,null,null,"2018-12-21","18/19","17/18","16/17",null,"2018-12-21","N/A","N/A","N/A"]
[null,null,null,null,null,null,null,"2018-12-22","18/19","17/18","16/17",null,"2018-12-22","N/A","N/A","N/A"]
[null,null,null,null,null,null,null,"2018-12-23","18/19","17/18","16/17",null,"2018-12-23","N/A","N/A","N/A"]
[null,null,null,null,null,null,null,"2018-12-24","18/19","17/18","16/17",null,"2018-12-24","N/A","N/A","N/A"]
[null,null,null,null,null,null,null,"2018-12-25","18/19","17/18","16/17",null,"2018-12-25","N/A","N/A","N/A"]
[null,null,null,null,null,null,null,"2018-12-26","18/19","17/18","16/17",null,"2018-12-26","N/A","N/A","N/A"]
[null,null,null,null,null,null,null,"2018-12-27","18/19","17/18","16/17",null,"2018-12-27","N/A","N/A","N/A"]
[null,null,null,null,null,null,null,"2018-12-28","18/19","17/18","16/17",null,"2018-12-28","N/A","N/A","N/A"]
[null,null,null,null,null,null,null,"2018-12-29","18/19","17/18","16/17",null,"2018-12-29","N/A","N/A","N/A"]
[null,null,null,null,null,null,null,"2018-12-30","18/19","17/18","16/17",null,"2018-12-30","N/A","N/A","N/A"]
[null,null,null,null,null,null,null,"2018-12-31","18/19","17/18","16/17",null,"2018-12-31","N/A","N/A","N/A"]
[null,null,null,null,null,null,null,"2019-01-01","18/19","17/18","16/17",null,"2019-01-01","N/A","N/A","N/A"]
[null,null,null,null,null,null,null,"2019-01-02","18/19","17/18","16/17",null,"2019-01-02","N/A","N/A","N/A"]
[null,null,null,null,null,null,null,"2019-01-03","18/19","17/18","16/17",null,"2019-01-03","N/A","N/A","N/A"]
[null,null,null,null,null,null,null,"2019-01-04","18/19","17/18","16/17",null,"2019-01-04","N/A","N/A","N/A"]
[null,null,null,null,null,null,null,"2019-01-05","18/19","17/18","16/17",null,"2019-01-05","N/A","N/A","N/A"]
[null,null,null,null,null,null,null,"2019-01-06","18/19","17/18","16/17",null,"2019-01-06","N/A","N/A","N/A"]
[null,null,null,null,null,null,null,"2019-01-07","18/19","17/18","16/17",null,"2019-01-07","N/A","N/A","N/A"]
[null,null,null,null,null,null,null,"2019-01-08","18/19","17/18","16/17",null,"2019-01-08","N/A","N/A","N/A"]
[null,null,null,null,null,null,null,"2019-01-09","18/19","17/18","16/17",null,"2019-01-09","N/A","N/A","N/A"]
[null,null,null,null,null,null,null,"2019-01-10","18/19","17/18","16/17",null,"2019-01-10","N/A","N/A","N/A"]
[null,null,null,null,null,null,null,"2019-01-11","18/19","17/18","16/17",null,"2019-01-11","N/A","N/A","N/A"]
[null,null,null,null,null,null,null,"2019-01-12","18/19","17/18","16/17",null,"2019-01-12","N/A","N/A","N/A"]
[null,null,null,null,null,null,null,"2019-01-13","18/19","17/18","16/17",null,"2019-01-13","N/A","N/A","N/A"]
[null,null,null,null,null,null,null,"2019-01-14","18/19","17/18","16/17",null,"2019-01-14","N/A","N/A","N/A"]
[null,null,null,null,null,null,null,"2019-01-15","18/19","17/18","16/17",null,"2019-01-15","N/A","N/A","N/A"]
[null,null,null,null,null,null,null,"2019-01-16","18/19","17/18","16/17",null,"2019-01-16","N/A","N/A","N/A"]
[null,null,null,null,null,null,null,"2019-01-17","18/19","17/18","16/17",null,"2019-01-17","N/A","N/A","N/A"]
[null,null,null,null,null,null,null,"2019-01-18","18/19","17/18","16/17",null,"2019-01-18","N/A","N/A","N/A"]
[null,null,null,null,null,null,null,"2019-01-19","18/19","17/18","16/17",null,"2019-01-19","N/A","N/A","N/A"]
[null,null,null,null,null,null,null,"2019-01-20","18/19","17/18","16/17",null,"2019-01-20","N/A","N/A","N/A"]
[null,null,null,null,null,null,null,"2019-01-21","18/19","17/18","16/17",null,"2019-01-21","N/A","N/A","N/A"]
[null,null,null,null,null,null,null,"2019-01-22","18/19","17/18","16/17",null,"2019-01-22","N/A","N/A","N/A"]
[null,null,null,null,null,null,null,"2019-01-23","18/19","17/18","16/17",null,"2019-01-23","N/A","N/A","N/A"]
[null,null,null,null,null,null,null,"2019-01-24","18/19","17/18","16/17",null,"2019-01-24","N/A","N/A","N/A"]
[null,null,null,null,null,null,null,"2019-01-25","18/19","17/18","16/17",null,"2019-01-25","N/A","N/A","N/A"]
[null,null,null,null,null,null,null,"2019-01-26","18/19","17/18","16/17",null,"2019-01-26","N/A","N/A","N/A"]
[null,null,null,null,null,null,null,"2019-01-27","18/19","17/18","16/17",null,"2019-01-27","N/A","N/A","N/A"]
[null,null,null,null,null,null,null,"2019-01-28","18/19","17/18","16/17",null,"2019-01-28","N/A","N/A","N/A"]
[null,null,null,null,null,null,null,"2019-01-29","18/19","17/18","16/17",null,"2019-01-29","N/A","N/A","N/A"]
[null,null,null,null,null,null,null,"2019-01-30","18/19","17/18","16/17",null,"2019-01-30","N/A","N/A","N/A"]
[null,null,null,null,null,null,null,"2019-01-31","18/19","17/18","16/17",null,"2019-01-31","N/A","N/A","N/A"]
[null,null,null,null,null,null,null,"2019-02-01","18/19","17/18","16/17",null,"2019-02-01","N/A","N/A","N/A"]
[null,null,null,null,null,null,null,"2019-02-02","18/19","17/18","16/17",null,"2019-02-02","N/A","N/A","N/A"]
[null,null,null,null,null,null,null,"2019-02-03","18/19","17/18","16/17",null,"2019-02-03","N/A","N/A","N/A"]
[null,null,null,null,null,null,null,"2019-02-04","18/19","17/18","16/17",null,"2019-02-04","N/A","N/A","N/A"]
[null,null,null,null,null,null,null,"2019-02-05","18/19","17/18","16/17",null,"2019-02-05","N/A","N/A","N/A"]
[null,null,null,null,null,null,null,"2019-02-06","18/19","17/18","16/17",null,"2019-02-06","N/A","N/A","N/A"]
[null,null,null,null,null,null,null,"2019-02-07","18/19","17/18","16/17",null,"2019-02-07","N/A","N/A","N/A"]
[null,null,null,null,null,null,null,"2019-02-08","18/19","17/18","16/17",null,"2019-02-08","N/A","N/A","N/A"]
[null,null,null,null,null,null,null,"2019-02-09","18/19","17/18","16/17",null,"2019-02-09","N/A","N/A","N/A"]
[null,null,null,null,null,null,null,"2019-02-10","18/19","17/18","16/17",null,"2019-02-10","N/A","N/A","N/A"]
[null,null,null,null,null,null,null,"2019-02-11","18/19","17/18","16/17",null,"2019-02-11","N/A","N/A","N/A"]
[null,null,null,null,null,null,null,"2019-02-12","18/19","17/18","16/17",null,"2019-02-12","N/A","N/A","N/A"]
[null,null,null,null,null,null,null,"2019-02-13","18/19","17/18","16/17",null,"2019-02-13","N/A","N/A","N/A"]
[null,null,null,null,null,null,null,"2019-02-14","18/19","17/18","16/17",null,"2019-02-14","N/A","N/A","N/A"]
[null,null,null,null,null,null,null,"2019-02-15","18/19","17/18","16/17",null,"2019-02-15","N/A","N/A","N/A"]
[null,null,null,null,null,null,null,"2019-02-16","18/19","17/18","16/17",null,"2019-02-16","N/A","N/A","N/A"]
[null,null,null,null,null,null,null,"2019-02-17","18/19","17/18","16/17",null,"2019-02-17","N/A","N/A","N/A"]
[null,null,null,null,null,null,null,"2019-02-18","18/19","17/18","16/17",null,"2019-02-18","N/A","N/A","N/A"]
[null,null,null,null,null,null,null,"2019-02-19","18/19","17/18","16/17",null,"2019-02-19","N/A","N/A","N/A"]
[null,null,null,null,null,null,null,"2019-02-20","18/19","17/18","16/17",null,"2019-02-20","N/A","N/A","N/A"]
[null,null,null,null,null,null,null,"2019-02-21","18/19","17/18","16/17",null,"2019-02-21","N/A","N/A","N/A"]
[null,null,null,null,null,null,null,"2019-02-22","18/19","17/18","16/17",null,"2019-02-22","N/A","N/A","N/A"]
[null,null,null,null,null,null,null,"2019-02-23","18/19","17/18","16/17",null,"2019-02-23","N/A","N/A","N/A"]
[null,null,null,null,null,null,null,"2019-02-24","18/19","17/18","16/17",null,"2019-02-24","N/A","N/A","N/A"]
[null,null,null,null,null,null,null,"2019-02-25","18/19","17/18","16/17",null,"2019-02-25","N/A","N/A","N/A"]
[null,null,null,null,null,null,null,"2019-02-26","18/19","17/18","16/17",null,"2019-02-26","N/A","N/A","N/A"]
[null,null,null,null,null,null,null,"2019-02-27","18/19","17/18","16/17",null,"2019-02-27","N/A","N/A","N/A"]
[null,null,null,null,null,null,null,"2019-02-28","18/19","17/18","16/17",null,"2019-02-28","N/A","N/A","N/A"]
[null,null,null,null,null,null,null,"2019-03-01","18/19","17/18","16/17",null,"2019-03-01","N/A","N/A","N/A"]
[null,null,null,null,null,null,null,"2019-03-02","18/19","17/18","16/17",null,"2019-03-02","N/A","N/A","N/A"]
[null,null,null,null,null,null,null,"2019-03-03","18/19","17/18","16/17",null,"2019-03-03","N/A","N/A","N/A"]
[null,null,null,null,null,null,null,"2019-03-04","18/19","17/18","16/17",null,"2019-03-04","N/A","N/A","N/A"]
[null,null,null,null,null,null,null,"2019-03-05","18/19","17/18","16/17",null,"2019-03-05","N/A","N/A","N/A"]
[null,null,null,null,null,null,null,"2019-03-06","18/19","17/18","16/17",null,"2019-03-06","N/A","N/A","N/A"]
[null,null,null,null,null,null,null,"2019-03-07","18/19","17/18","16/17",null,"2019-03-07","N/A","N/A","N/A"]
[null,null,null,null,null,null,null,"2019-03-08","18/19","17/18","16/17",null,"2019-03-08","N/A","N/A","N/A"]
[null,null,null,null,null,null,null,"2019-03-09","18/19","17/18","16/17",null,"2019-03-09","N/A","N/A","N/A"]
[null,null,null,null,null,null,null,"2019-03-10","18/19","17/18","16/17",null,"2019-03-10","N/A","N/A","N/A"]
[null,null,null,null,null,null,null,"2019-03-11","18/19","17/18","16/17",null,"2019-03-11","N/A","N/A","N/A"]
[null,null,null,null,null,null,null,"2019-03-12","18/19","17/18","16/17",null,"2019-03-12","N/A","N/A","N/A"]
[null,null,null,null,null,null,null,"2019-03-13","18/19","17/18","16/17",null,"2019-03-13","N/A","N/A","N/A"]
[null,null,null,null,null,null,null,"2019-03-14","18/19","17/18","16/17",null,"2019-03-14","N/A","N/A","N/A"]
[null,null,null,null,null,null,null,"2019-03-15","18/19","17/18","16/17",null,"2019-03-15","N/A","N/A","N/A"]
[null,null,null,null,null,null,null,"2019-03-16","18/19","17/18","16/17",null,"2019-03-16","N/A","N/A","N/A"]
[null,null,null,null,null,null,null,"2019-03-17","18/19","17/18","16/17",null,"2019-03-17","N/A","N/A","N/A"]
[null,null,null,null,null,null,null,"2019-03-18","18/19","17/18","16/17",null,"2019-03-18","N/A","N/A","N/A"]
[null,null,null,null,null,null,null,"2019-03-19","18/19","17/18","16/17",null,"2019-03-19","N/A","N/A","N/A"]
[null,null,null,null,null,null,null,"2019-03-20","18/19","17/18","16/17",null,"2019-03-20","N/A","N/A","N/A"]
[null,null,null,null,null,null,null,"2019-03-21","18/19","17/18","16/17",null,"2019-03-21","N/A","N/A","N/A"]
[null,null,null,null,null,null,null,"2019-03-22","18/19","17/18","16/17",null,"2019-03-22","N/A","N/A","N/A"]
[null,null,null,null,null,null,null,"2019-03-23","18/19","17/18","16/17",null,"2019-03-23","N/A","N/A","N/A"]
[null,null,null,null,null,null,null,"2019-03-24","18/19","17/18","16/17",null,"2019-03-24","N/A","N/A","N/A"]
[null,null,null,null,null,null,null,"2019-03-25","18/19","17/18","16/17",null,"2019-03-25","N/A","N/A","N/A"]
[null,null,null,null,null,null,null,"2019-03-26","18/19","17/18","16/17",null,"2019-03-26","N/A","N/A","N/A"]
[null,null,null,null,null,null,null,"2019-03-27","18/19","17/18","16/17",null,"2019-03-27","N/A","N/A","N/A"]
[null,null,null,null,null,null,null,"2019-03-28","18/19","17/18","16/17",null,"2019-03-28","N/A","N/A","N/A"]
[null,null,null,null,null,null,null,"2019-03-29","18/19","17/18","16/17",null,"2019-03-29","N/A","N/A","N/A"]
[null,null,null,null,null,null,null,"2019-03-30","18/19","17/18","16/17",null,"2019-03-30","N/A","N/A","N/A"]
[null,null,null,null,null,null,null,"2019-03-31","18/19","17/18","16/17",null,"2019-03-31","N/A","N/A","N/A"]
[null,null,null,null,null,null,null,"2019-04-01","18/19","17/18","16/17",null,"2019-04-01","N/A","N/A","N/A"]
[null,null,null,null,null,null,null,"2019-04-02","18/19","17/18","16/17",null,"2019-04-02","N/A","N/A","N/A"]
[null,null,null,null,null,null,null,"2019-04-03","18/19","17/18","16/17",null,"2019-04-03","N/A","N/A","N/A"]
[null,null,null,null,null,null,null,"2019-04-04","18/19","17/18","16/17",null,"2019-04-04","N/A","N/A","N/A"]
[null,null,null,null,null,null,null,"2019-04-05","18/19","17/18","16/17",null,"2019-04-05","N/A","N/A","N/A"]
[null,null,null,null,null,null,null,"2019-04-06","19/20","18/19","17/18",null,"2019-04-06","N/A","N/A","N/A"]
[null,null,null,null,null,null,null,"2019-04-07","19/20","18/19","17/18",null,"2019-04-07","N/A","N/A","N/A"]
[null,null,null,null,null,null,null,"2019-04-08","19/20","18/19","17/18",null,"2019-04-08","N/A","N/A","N/A"]
[null,null,null,null,null,null,null,"2019-04-09","19/20","18/19","17/18",null,"2019-04-09","N/A","N/A","N/A"]
[null,null,null,null,null,null,null,"2019-04-10","19/20","18/19","17/18",null,"2019-04-10","N/A","N/A","N/A"]
[null,null,null,null,null,null,null,"2019-04-11","19/20","18/19","17/18",null,"2019-04-11","N/A","N/A","N/A"]
[null,null,null,null,null,null,null,"2019-04-12","19/20","18/19","17/18",null,"2019-04-12","N/A","N/A","N/A"]
[null,null,null,null,null,null,null,"2019-04-13","19/20","18/19","17/18",null,"2019-04-13","N/A","N/A","N/A"]
[null,null,null,null,null,null,null,"2019-04-14","19/20","18/19","17/18",null,"2019-04-14","N/A","N/A","N/A"]
[null,null,null,null,null,null,null,"2019-04-15","19/20","18/19","17/18",null,"2019-04-15","N/A","N/A","N/A"]
[null,null,null,null,null,null,null,"2019-04-16","19/20","18/19","17/18",null,"2019-04-16","N/A","N/A","N/A"]
[null,null,null,null,null,null,null,"2019-04-17","19/20","18/19","17/18",null,"2019-04-17","N/A","N/A","N/A"]
[null,null,null,null,null,null,null,"2019-04-18","19/20","18/19","17/18",null,"2019-04-18","N/A","N/A","N/A"]
[null,null,null,null,null,null,null,"2019-04-19","19/20","18/19","17/18",null,"2019-04-19","N/A","N/A","N/A"]
[null,null,null,null,null,null,null,"2019-04-20","19/20","18/19","17/18",null,"2019-04-20","N/A","N/A","N/A"]
[null,null,null,null,null,null,null,"2019-04-21","19/20","18/19","17/18",null,"2019-04-21","N/A","N/A","N/A"]
[null,null,null,null,null,null,null,"2019-04-22","19/20","18/19","17/18",null,"2019-04-22","N/A","N/A","N/A"]
[null,null,null,null,null,null,null,"2019-04-23","19/20","18/19","17/18",null,"2019-04-23","N/A","N/A","N/A"]
[null,null,null,null,null,null,null,"2019-04-24","19/20","18/19","17/18",null,"2019-04-24","N/A","N/A","N/A"]
[null,null,null,null,null,null,null,"2019-04-25","19/20","18/19","17/18",null,"2019-04-25","N/A","N/A","N/A"]
[null,null,null,null,null,null,null,"2019-04-26","19/20","18/19","17/18",null,"2019-04-26","N/A","N/A","N/A"]
[null,null,null,null,null,null,null,"2019-04-27","19/20","18/19","17/18",null,"2019-04-27","N/A","N/A","N/A"]
[null,null,null,null,null,null,null,"2019-04-28","19/20","18/19","17/18",null,"2019-04-28","N/A","N/A","N/A"]
[null,null,null,null,null,null,null,"2019-04-29","19/20","18/19","17/18",null,"2019-04-29","N/A","N/A","N/A"]
[null,null,null,null,null,null,null,"2019-04-30","19/20","18/19","17/18",null,"2019-04-30","N/A","N/A","N/A"]
[null,null,null,null,null,null,null,"2019-05-01","19/20","18/19","17/18",null,"2019-05-01","N/A","N/A","N/A"]
[null,null,null,null,null,null,null,"2019-05-02","19/20","18/19","17/18",null,"2019-05-02","N/A","N/A","N/A"]
[null,null,null,null,null,null,null,"2019-05-03","19/20","18/19","17/18",null,"2019-05-03","N/A","N/A","N/A"]
[null,null,null,null,null,null,null,"2019-05-04","19/20","18/19","17/18",null,"2019-05-04","N/A","N/A","N/A"]
[null,null,null,null,null,null,null,"2019-05-05","19/20","18/19","17/18",null,"2019-05-05","N/A","N/A","N/A"]
[null,null,null,null,null,null,null,"2019-05-06","19/20","18/19","17/18",null,"2019-05-06","N/A","N/A","N/A"]
[null,null,null,null,null,null,null,"2019-05-07","19/20","18/19","17/18",null,"2019-05-07","N/A","N/A","N/A"]
[null,null,null,null,null,null,null,"2019-05-08","19/20","18/19","17/18",null,"2019-05-08","N/A","N/A","N/A"]
[null,null,null,null,null,null,null,"2019-05-09","19/20","18/19","17/18",null,"2019-05-09","N/A","N/A","N/A"]
[null,null,null,null,null,null,null,"2019-05-10","19/20","18/19","17/18",null,"2019-05-10","N/A","N/A","N/A"]
[null,null,null,null,null,null,null,"2019-05-11","19/20","18/19","17/18",null,"2019-05-11","N/A","N/A","N/A"]
[null,null,null,null,null,null,null,"2019-05-12","19/20","18/19","17/18",null,"2019-05-12","N/A","N/A","N/A"]
[null,null,null,null,null,null,null,"2019-05-13","19/20","18/19","17/18",null,"2019-05-13","N/A","N/A","N/A"]
[null,null,null,null,null,null,null,"2019-05-14","19/20","18/19","17/18",null,"2019-05-14","N/A","N/A","N/A"]
[null,null,null,null,null,null,null,"2019-05-15","19/20","18/19","17/18",null,"2019-05-15","N/A","N/A","N/A"]
[null,null,null,null,null,null,null,"2019-05-16","19/20","18/19","17/18",null,"2019-05-16","N/A","N/A","N/A"]
[null,null,null,null,null,null,null,"2019-05-17","19/20","18/19","17/18",null,"2019-05-17","N/A","N/A","N/A"]
[null,null,null,null,null,null,null,"2019-05-18","19/20","18/19","17/18",null,"2019-05-18","N/A","N/A","N/A"]
[null,null,null,null,null,null,null,"2019-05-19","19/20","18/19","17/18",null,"2019-05-19","N/A","N/A","N/A"]
[null,null,null,null,null,null,null,"2019-05-20","19/20","18/19","17/18",null,"2019-05-20","N/A","N/A","N/A"]
[null,null,null,null,null,null,null,"2019-05-21","19/20","18/19","17/18",null,"2019-05-21","N/A","N/A","N/A"]
[null,null,null,null,null,null,null,"2019-05-22","19/20","18/19","17/18",null,"2019-05-22","N/A","N/A","N/A"]
[null,null,null,null,null,null,null,"2019-05-23","19/20","18/19","17/18",null,"2019-05-23","N/A","N/A","N/A"]
[null,null,null,null,null,null,null,"2019-05-24","19/20","18/19","17/18",null,"2019-05-24","N/A","N/A","N/A"]
[null,null,null,null,null,null,null,"2019-05-25","19/20","18/19","17/18",null,"2019-05-25","N/A","N/A","N/A"]
[null,null,null,null,null,null,null,"2019-05-26","19/20","18/19","17/18",null,"2019-05-26","N/A","N/A","N/A"]
[null,null,null,null,null,null,null,"2019-05-27","19/20","18/19","17/18",null,"2019-05-27","N/A","N/A","N/A"]
[null,null,null,null,null,null,null,"2019-05-28","19/20","18/19","17/18",null,"2019-05-28","N/A","N/A","N/A"]
[null,null,null,null,null,null,null,"2019-05-29","19/20","18/19","17/18",null,"2019-05-29","N/A","N/A","N/A"]
[null,null,null,null,null,null,null,"2019-05-30","19/20","18/19","17/18",null,"2019-05-30","N/A","N/A","N/A"]
[null,null,null,null,null,null,null,"2019-05-31","19/20","18/19","17/18",null,"2019-05-31","N/A","N/A","N/A"]
[null,null,null,null,null,null,null,"2019-06-01","19/20","18/19","17/18",null,"2019-06-01","N/A","N/A","N/A"]
[null,null,null,null,null,null,null,"2019-06-02","19/20","18/19","17/18",null,"2019-06-02","N/A","N/A","N/A"]
[null,null,null,null,null,null,null,"2019-06-03","19/20","18/19","17/18",null,"2019-06-03","N/A","N/A","N/A"]
[null,null,null,null,null,null,null,"2019-06-04","19/20","18/19","17/18",null,"2019-06-04","N/A","N/A","N/A"]
[null,null,null,null,null,null,null,"2019-06-05","19/20","18/19","17/18",null,"2019-06-05","N/A","N/A","N/A"]
[null,null,null,null,null,null,null,"2019-06-06","19/20","18/19","17/18",null,"2019-06-06","N/A","N/A","N/A"]
[null,null,null,null,null,null,null,"2019-06-07","19/20","18/19","17/18",null,"2019-06-07","N/A","N/A","N/A"]
[null,null,null,null,null,null,null,"2019-06-08","19/20","18/19","17/18",null,"2019-06-08","N/A","N/A","N/A"]
[null,null,null,null,null,null,null,"2019-06-09","19/20","18/19","17/18",null,"2019-06-09","N/A","N/A","N/A"]
[null,null,null,null,null,null,null,"2019-06-10","19/20","18/19","17/18",null,"2019-06-10","N/A","N/A","N/A"]
[null,null,null,null,null,null,null,"2019-06-11","19/20","18/19","17/18",null,"2019-06-11","N/A","N/A","N/A"]
[null,null,null,null,null,null,null,"2019-06-12","19/20","18/19","17/18",null,"2019-06-12","N/A","N/A","N/A"]
[null,null,null,null,null,null,null,"2019-06-13","19/20","18/19","17/18",null,"2019-06-13","N/A","N/A","N/A"]
[null,null,null,null,null,null,null,"2019-06-14","19/20","18/19","17/18",null,"2019-06-14","N/A","N/A","N/A"]
[null,null,null,null,null,null,null,"2019-06-15","19/20","18/19","17/18",null,"2019-06-15","N/A","N/A","N/A"]
[null,null,null,null,null,null,null,"2019-06-16","19/20","18/19","17/18",null,"2019-06-16","N/A","N/A","N/A"]
[null,null,null,null,null,null,null,"2019-06-17","19/20","18/19","17/18",null,"2019-06-17","N/A","N/A","N/A"]
[null,null,null,null,null,null,null,"2019-06-18","19/20","18/19","17/18",null,"2019-06-18","N/A","N/A","N/A"]
[null,null,null,null,null,null,null,"2019-06-19","19/20","18/19","17/18",null,"2019-06-19","N/A","N/A","N/A"]
[null,null,null,null,null,null,null,"2019-06-20","19/20","18/19","17/18",null,"2019-06-20","N/A","N/A","N/A"]
[null,null,null,null,null,null,null,"2019-06-21","19/20","18/19","17/18",null,"2019-06-21","N/A","N/A","N/A"]
[null,null,null,null,null,null,null,"2019-06-22","19/20","18/19","17/18",null,"2019-06-22","N/A","N/A","N/A"]
[null,null,null,null,null,null,null,"2019-06-23","19/20","18/19","17/18",null,"2019-06-23","N/A","N/A","N/A"]
[null,null,null,null,null,null,null,"2019-06-24","19/20","18/19","17/18",null,"2019-06-24","N/A","N/A","N/A"]
[null,null,null,null,null,null,null,"2019-06-25","19/20","18/19","17/18",null,"2019-06-25","N/A","N/A","N/A"]
[null,null,null,null,null,null,null,"2019-06-26","19/20","18/19","17/18",null,"2019-06-26","N/A","N/A","N/A"]
[null,null,null,null,null,null,null,"2019-06-27","19/20","18/19","17/18",null,"2019-06-27","N/A","N/A","N/A"]
[null,null,null,null,null,null,null,"2019-06-28","19/20","18/19","17/18",null,"2019-06-28","N/A","N/A","N/A"]
[null,null,null,null,null,null,null,"2019-06-29","19/20","18/19","17/18",null,"2019-06-29","N/A","N/A","N/A"]
[null,null,null,null,null,null,null,"2019-06-30","19/20","18/19","17/18",null,"2019-06-30","N/A","N/A","N/A"]
[null,null,null,null,null,null,null,"2019-07-01","19/20","18/19","17/18",null,"2019-07-01","N/A","N/A","N/A"]
[null,null,null,null,null,null,null,"2019-07-02","19/20","18/19","17/18",null,"2019-07-02","N/A","N/A","N/A"]
[null,null,null,null,null,null,null,"2019-07-03","19/20","18/19","17/18",null,"2019-07-03","N/A","N/A","N/A"]
[null,null,null,null,null,null,null,"2019-07-04","19/20","18/19","17/18",null,"2019-07-04","N/A","N/A","N/A"]
[null,null,null,null,null,null,null,"2019-07-05","19/20","18/19","17/18",null,"2019-07-05","N/A","N/A","N/A"]
[null,null,null,null,null,null,null,"2019-07-06","19/20","18/19","17/18",null,"2019-07-06","N/A","N/A","N/A"]
[null,null,null,null,null,null,null,"2019-07-07","19/20","18/19","17/18",null,"2019-07-07","N/A","N/A","N/A"]
[null,null,null,null,null,null,null,"2019-07-08","19/20","18/19","17/18",null,"2019-07-08","N/A","N/A","N/A"]
[null,null,null,null,null,null,null,"2019-07-09","19/20","18/19","17/18",null,"2019-07-09","N/A","N/A","N/A"]
[null,null,null,null,null,null,null,"2019-07-10","19/20","18/19","17/18",null,"2019-07-10","N/A","N/A","N/A"]
[null,null,null,null,null,null,null,"2019-07-11","19/20","18/19","17/18",null,"2019-07-11","N/A","N/A","N/A"]
[null,null,null,null,null,null,null,"2019-07-12","19/20","18/19","17/18",null,"2019-07-12","N/A","N/A","N/A"]
[null,null,null,null,null,null,null,"2019-07-13","19/20","18/19","17/18",null,"2019-07-13","N/A","N/A","N/A"]
[null,null,null,null,null,null,null,"2019-07-14","19/20","18/19","17/18",null,"2019-07-14","N/A","N/A","N/A"]
[null,null,null,null,null,null,null,"2019-07-15","19/20","18/19","17/18",null,"2019-07-15","N/A","N/A","N/A"]
[null,null,null,null,null,null,null,"2019-07-16","19/20","18/19","17/18",null,"2019-07-16","N/A","N/A","N/A"]
[null,null,null,null,null,null,null,"2019-07-17","19/20","18/19","17/18",null,"2019-07-17","N/A","N/A","N/A"]
[null,null,null,null,null,null,null,"2019-07-18","19/20","18/19","17/18",null,"2019-07-18","N/A","N/A","N/A"]
[null,null,null,null,null,null,null,"2019-07-19","19/20","18/19","17/18",null,"2019-07-19","N/A","N/A","N/A"]
[null,null,null,null,null,null,null,"2019-07-20","19/20","18/19","17/18",null,"2019-07-20","N/A","N/A","N/A"]
[null,null,null,null,null,null,null,"2019-07-21","19/20","18/19","17/18",null,"2019-07-21","N/A","N/A","N/A"]
[null,null,null,null,null,null,null,"2019-07-22","19/20","18/19","17/18",null,"2019-07-22","N/A","N/A","N/A"]
[null,null,null,null,null,null,null,"2019-07-23","19/20","18/19","17/18",null,"2019-07-23","N/A","N/A","N/A"]
[null,null,null,null,null,null,null,"2019-07-24","19/20","18/19","17/18",null,"2019-07-24","N/A","N/A","N/A"]
[null,null,null,null,null,null,null,"2019-07-25","19/20","18/19","17/18",null,"2019-07-25","N/A","N/A","N/A"]
[null,null,null,null,null,null,null,"2019-07-26","19/20","18/19","17/18",null,"2019-07-26","N/A","N/A","N/A"]
[null,null,null,null,null,null,null,"2019-07-27","19/20","18/19","17/18",null,"2019-07-27","N/A","N/A","N/A"]
[null,null,null,null,null,null,null,"2019-07-28","19/20","18/19","17/18",null,"2019-07-28","N/A","N/A","N/A"]
[null,null,null,null,null,null,null,"2019-07-29","19/20","18/19","17/18",null,"2019-07-29","N/A","N/A","N/A"]
[null,null,null,null,null,null,null,"2019-07-30","19/20","18/19","17/18",null,"2019-07-30","N/A","N/A","N/A"]
[null,null,null,null,null,null,null,"2019-07-31","19/20","18/19","17/18",null,"2019-07-31","N/A","N/A","N/A"]
[null,null,null,null,null,null,null,"2019-08-01","19/20","18/19","17/18",null,"2019-08-01","N/A","N/A","N/A"]
[null,null,null,null,null,null,null,"2019-08-02","19/20","18/19","17/18",null,"2019-08-02","N/A","N/A","N/A"]
[null,null,null,null,null,null,null,"2019-08-03","19/20","18/19","17/18",null,"2019-08-03","N/A","N/A","N/A"]
[null,null,null,null,null,null,null,"2019-08-04","19/20","18/19","17/18",null,"2019-08-04","N/A","N/A","N/A"]
[null,null,null,null,null,null,null,"2019-08-05","19/20","18/19","17/18",null,"2019-08-05","N/A","N/A","N/A"]
[null,null,null,null,null,null,null,"2019-08-06","19/20","18/19","17/18",null,"2019-08-06","N/A","N/A","N/A"]
[null,null,null,null,null,null,null,"2019-08-07","19/20","18/19","17/18",null,"2019-08-07","N/A","N/A","N/A"]
[null,null,null,null,null,null,null,"2019-08-08","19/20","18/19","17/18",null,"2019-08-08","N/A","N/A","N/A"]
[null,null,null,null,null,null,null,"2019-08-09","19/20","18/19","17/18",null,"2019-08-09","N/A","N/A","N/A"]
[null,null,null,null,null,null,null,"2019-08-10","19/20","18/19","17/18",null,"2019-08-10","N/A","N/A","N/A"]
[null,null,null,null,null,null,null,"2019-08-11","19/20","18/19","17/18",null,"2019-08-11","N/A","N/A","N/A"]
[null,null,null,null,null,null,null,"2019-08-12","19/20","18/19","17/18",null,"2019-08-12","N/A","N/A","N/A"]
[null,null,null,null,null,null,null,"2019-08-13","19/20","18/19","17/18",null,"2019-08-13","N/A","N/A","N/A"]
[null,null,null,null,null,null,null,"2019-08-14","19/20","18/19","17/18",null,"2019-08-14","N/A","N/A","N/A"]
[null,null,null,null,null,null,null,"2019-08-15","19/20","18/19","17/18",null,"2019-08-15","N/A","N/A","N/A"]
[null,null,null,null,null,null,null,"2019-08-16","19/20","18/19","17/18",null,"2019-08-16","N/A","N/A","N/A"]
[null,null,null,null,null,null,null,"2019-08-17","19/20","18/19","17/18",null,"2019-08-17","N/A","N/A","N/A"]
[null,null,null,null,null,null,null,"2019-08-18","19/20","18/19","17/18",null,"2019-08-18","N/A","N/A","N/A"]
[null,null,null,null,null,null,null,"2019-08-19","19/20","18/19","17/18",null,"2019-08-19","N/A","N/A","N/A"]
[null,null,null,null,null,null,null,"2019-08-20","19/20","18/19","17/18",null,"2019-08-20","N/A","N/A","N/A"]
[null,null,null,null,null,null,null,"2019-08-21","19/20","18/19","17/18",null,"2019-08-21","N/A","N/A","N/A"]
[null,null,null,null,null,null,null,"2019-08-22","19/20","18/19","17/18",null,"2019-08-22","N/A","N/A","N/A"]
[null,null,null,null,null,null,null,"2019-08-23","19/20","18/19","17/18",null,"2019-08-23","N/A","N/A","N/A"]
[null,null,null,null,null,null,null,"2019-08-24","19/20","18/19","17/18",null,"2019-08-24","N/A","N/A","N/A"]
[null,null,null,null,null,null,null,"2019-08-25","19/20","18/19","17/18",null,"2019-08-25","N/A","N/A","N/A"]
[null,null,null,null,null,null,null,"2019-08-26","19/20","18/19","17/18",null,"2019-08-26","N/A","N/A","N/A"]
[null,null,null,null,null,null,null,"2019-08-27","19/20","18/19","17/18",null,"2019-08-27","N/A","N/A","N/A"]
[null,null,null,null,null,null,null,"2019-08-28","19/20","18/19","17/18",null,"2019-08-28","N/A","N/A","N/A"]
[null,null,null,null,null,null,null,"2019-08-29","19/20","18/19","17/18",null,"2019-08-29","N/A","N/A","N/A"]
[null,null,null,null,null,null,null,"2019-08-30","19/20","18/19","17/18",null,"2019-08-30","N/A","N/A","N/A"]
[null,null,null,null,null,null,null,"2019-08-31","19/20","18/19","17/18",null,"2019-08-31","N/A","N/A","N/A"]
[null,null,null,null,null,null,null,"2019-09-01","19/20","18/19","17/18",null,"2019-09-01","N/A","N/A","N/A"]
[null,null,null,null,null,null,null,"2019-09-02","19/20","18/19","17/18",null,"2019-09-02","N/A","N/A","N/A"]
[null,null,null,null,null,null,null,"2019-09-03","19/20","18/19","17/18",null,"2019-09-03","N/A","N/A","N/A"]
[null,null,null,null,null,null,null,"2019-09-04","19/20","18/19","17/18",null,"2019-09-04","N/A","N/A","N/A"]
[null,null,null,null,null,null,null,"2019-09-05","19/20","18/19","17/18",null,"2019-09-05","N/A","N/A","N/A"]
[null,null,null,null,null,null,null,"2019-09-06","19/20","18/19","17/18",null,"2019-09-06","N/A","N/A","N/A"]
[null,null,null,null,null,null,null,"2019-09-07","19/20","18/19","17/18",null,"2019-09-07","N/A","N/A","N/A"]
[null,null,null,null,null,null,null,"2019-09-08","19/20","18/19","17/18",null,"2019-09-08","N/A","N/A","N/A"]
[null,null,null,null,null,null,null,"2019-09-09","19/20","18/19","17/18",null,"2019-09-09","N/A","N/A","N/A"]
[null,null,null,null,null,null,null,"2019-09-10","19/20","18/19","17/18",null,"2019-09-10","N/A","N/A","N/A"]
[null,null,null,null,null,null,null,"2019-09-11","19/20","18/19","17/18",null,"2019-09-11","N/A","N/A","N/A"]
[null,null,null,null,null,null,null,"2019-09-12","19/20","18/19","17/18",null,"2019-09-12","N/A","N/A","N/A"]
[null,null,null,null,null,null,null,"2019-09-13","19/20","18/19","17/18",null,"2019-09-13","N/A","N/A","N/A"]
[null,null,null,null,null,null,null,"2019-09-14","19/20","18/19","17/18",null,"2019-09-14","N/A","N/A","N/A"]
[null,null,null,null,null,null,null,"2019-09-15","19/20","18/19","17/18",null,"2019-09-15","N/A","N/A","N/A"]
[null,null,null,null,null,null,null,"2019-09-16","19/20","18/19","17/18",null,"2019-09-16","N/A","N/A","N/A"]
[null,null,null,null,null,null,null,"2019-09-17","19/20","18/19","17/18",null,"2019-09-17","N/A","N/A","N/A"]
[null,null,null,null,null,null,null,"2019-09-18","19/20","18/19","17/18",null,"2019-09-18","N/A","N/A","N/A"]
[null,null,null,null,null,null,null,"2019-09-19","19/20","18/19","17/18",null,"2019-09-19","N/A","N/A","N/A"]
[null,null,null,null,null,null,null,"2019-09-20","19/20","18/19","17/18",null,"2019-09-20","N/A","N/A","N/A"]
[null,null,null,null,null,null,null,"2019-09-21","19/20","18/19","17/18",null,"2019-09-21","N/A","N/A","N/A"]
[null,null,null,null,null,null,null,"2019-09-22","19/20","18/19","17/18",null,"2019-09-22","N/A","N/A","N/A"]
[null,null,null,null,null,null,null,"2019-09-23","19/20","18/19","17/18",null,"2019-09-23","N/A","N/A","N/A"]
[null,null,null,null,null,null,null,"2019-09-24","19/20","18/19","17/18",null,"2019-09-24","N/A","N/A","N/A"]
[null,null,null,null,null,null,null,"2019-09-25","19/20","18/19","17/18",null,"2019-09-25","N/A","N/A","N/A"]
[null,null,null,null,null,null,null,"2019-09-26","19/20","18/19","17/18",null,"2019-09-26","N/A","N/A","N/A"]
[null,null,null,null,null,null,null,"2019-09-27","19/20","18/19","17/18",null,"2019-09-27","N/A","N/A","N/A"]
[null,null,null,null,null,null,null,"2019-09-28","19/20","18/19","17/18",null,"2019-09-28","N/A","N/A","N/A"]
[null,null,null,null,null,null,null,"2019-09-29","19/20","18/19","17/18",null,"2019-09-29","N/A","N/A","N/A"]
[null,null,null,null,null,null,null,"2019-09-30","19/20","18/19","17/18",null,"2019-09-30","N/A","N/A","N/A"]
[null,null,null,null,null,null,null,"2019-10-01","19/20","18/19","17/18",null,"2019-10-01","N/A","N/A","N/A"]
[null,null,null,null,null,null,null,"2019-10-02","19/20","18/19","17/18",null,"2019-10-02","N/A","N/A","N/A"]
[null,null,null,null,null,null,null,"2019-10-03","19/20","18/19","17/18",null,"2019-10-03","N/A","N/A","N/A"]
[null,null,null,null,null,null,null,"2019-10-04","19/20","18/19","17/18",null,"2019-10-04","N/A","N/A","N/A"]
[null,null,null,null,null,null,null,"2019-10-05","19/20","18/19","17/18",null,"2019-10-05","N/A","N/A","N/A"]
[null,null,null,null,null,null,null,"2019-10-06","19/20","18/19","17/18",null,"2019-10-06","N/A","N/A","N/A"]
[null,null,null,null,null,null,null,"2019-10-07","19/20","18/19","17/18",null,"2019-10-07","N/A","N/A","N/A"]
[null,null,null,null,null,null,null,"2019-10-08","19/20","18/19","17/18",null,"2019-10-08","N/A","N/A","N/A"]
[null,null,null,null,null,null,null,"2019-10-09","19/20","18/19","17/18",null,"2019-10-09","N/A","N/A","N/A"]
[null,null,null,null,null,null,null,"2019-10-10","19/20","18/19","17/18",null,"2019-10-10","N/A","N/A","N/A"]
[null,null,null,null,null,null,null,"2019-10-11","19/20","18/19","17/18",null,"2019-10-11","N/A","N/A","N/A"]
[null,null,null,null,null,null,null,"2019-10-12","19/20","18/19","17/18",null,"2019-10-12","N/A","N/A","N/A"]
[null,null,null,null,null,null,null,"2019-10-13","19/20","18/19","17/18",null,"2019-10-13","N/A","N/A","N/A"]
[null,null,null,null,null,null,null,"2019-10-14","19/20","18/19","17/18",null,"2019-10-14","N/A","N/A","N/A"]
[null,null,null,null,null,null,null,"2019-10-15","19/20","18/19","17/18",null,"2019-10-15","N/A","N/A","N/A"]
[null,null,null,null,null,null,null,"2019-10-16","19/20","18/19","17/18",null,"2019-10-16","N/A","N/A","N/A"]
[null,null,null,null,null,null,null,"2019-10-17","19/20","18/19","17/18",null,"2019-10-17","N/A","N/A","N/A"]
[null,null,null,null,null,null,null,"2019-10-18","19/20","18/19","17/18",null,"2019-10-18","N/A","N/A","N/A"]
[null,null,null,null,null,null,null,"2019-10-19","19/20","18/19","17/18",null,"2019-10-19","N/A","N/A","N/A"]
[null,null,null,null,null,null,null,"2019-10-20","19/20","18/19","17/18",null,"2019-10-20","N/A","N/A","N/A"]
[null,null,null,null,null,null,null,"2019-10-21","19/20","18/19","17/18",null,"2019-10-21","N/A","N/A","N/A"]
[null,null,null,null,null,null,null,"2019-10-22","19/20","18/19","17/18",null,"2019-10-22","N/A","N/A","N/A"]
[null,null,null,null,null,null,null,"2019-10-23","19/20","18/19","17/18",null,"2019-10-23","N/A","N/A","N/A"]
[null,null,null,null,null,null,null,"2019-10-24","19/20","18/19","17/18",null,"2019-10-24","N/A","N/A","N/A"]
[null,null,null,null,null,null,null,"2019-10-25","19/20","18/19","17/18",null,"2019-10-25","N/A","N/A","N/A"]
[null,null,null,null,null,null,null,"2019-10-26","19/20","18/19","17/18",null,"2019-10-26","N/A","N/A","N/A"]
[null,null,null,null,null,null,null,"2019-10-27","19/20","18/19","17/18",null,"2019-10-27","N/A","N/A","N/A"]
[null,null,null,null,null,null,null,"2019-10-28","19/20","18/19","17/18",null,"2019-10-28","N/A","N/A","N/A"]
[null,null,null,null,null,null,null,"2019-10-29","19/20","18/19","17/18",null,"2019-10-29","N/A","N/A","N/A"]
[null,null,null,null,null,null,null,"2019-10-30","19/20","18/19","17/18",null,"2019-10-30","N/A","N/A","N/A"]
[null,null,null,null,null,null,null,"2019-10-31","19/20","18/19","17/18",null,"2019-10-31","N/A","N/A","N/A"]
[null,null,null,null,null,null,null,"2019-11-01","19/20","18/19","17/18",null,"2019-11-01","N/A","N/A","N/A"]
[null,null,null,null,null,null,null,"2019-11-02","19/20","18/19","17/18",null,"2019-11-02","N/A","N/A","N/A"]
[null,null,null,null,null,null,null,"2019-11-03","19/20","18/19","17/18",null,"2019-11-03","N/A","N/A","N/A"]
[null,null,null,null,null,null,null,"2019-11-04","19/20","18/19","17/18",null,"2019-11-04","N/A","N/A","N/A"]
[null,null,null,null,null,null,null,"2019-11-05","19/20","18/19","17/18",null,"2019-11-05","N/A","N/A","N/A"]
[null,null,null,null,null,null,null,"2019-11-06","19/20","18/19","17/18",null,"2019-11-06","N/A","N/A","N/A"]
[null,null,null,null,null,null,null,"2019-11-07","19/20","18/19","17/18",null,"2019-11-07","N/A","N/A","N/A"]
[null,null,null,null,null,null,null,"2019-11-08","19/20","18/19","17/18",null,"2019-11-08","N/A","N/A","N/A"]
[null,null,null,null,null,null,null,"2019-11-09","19/20","18/19","17/18",null,"2019-11-09","N/A","N/A","N/A"]
[null,null,null,null,null,null,null,"2019-11-10","19/20","18/19","17/18",null,"2019-11-10","N/A","N/A","N/A"]
[null,null,null,null,null,null,null,"2019-11-11","19/20","18/19","17/18",null,"2019-11-11","N/A","N/A","N/A"]
[null,null,null,null,null,null,null,"2019-11-12","19/20","18/19","17/18",null,"2019-11-12","N/A","N/A","N/A"]
[null,null,null,null,null,null,null,"2019-11-13","19/20","18/19","17/18",null,"2019-11-13","N/A","N/A","N/A"]
[null,null,null,null,null,null,null,"2019-11-14","19/20","18/19","17/18",null,"2019-11-14","N/A","N/A","N/A"]
[null,null,null,null,null,null,null,"2019-11-15","19/20","18/19","17/18",null,"2019-11-15","N/A","N/A","N/A"]
[null,null,null,null,null,null,null,"2019-11-16","19/20","18/19","17/18",null,"2019-11-16","N/A","N/A","N/A"]
[null,null,null,null,null,null,null,"2019-11-17","19/20","18/19","17/18",null,"2019-11-17","N/A","N/A","N/A"]
[null,null,null,null,null,null,null,"2019-11-18","19/20","18/19","17/18",null,"2019-11-18","N/A","N/A","N/A"]
[null,null,null,null,null,null,null,"2019-11-19","19/20","18/19","17/18",null,"2019-11-19","N/A","N/A","N/A"]
[null,null,null,null,null,null,null,"2019-11-20","19/20","18/19","17/18",null,"2019-11-20","N/A","N/A","N/A"]
[null,null,null,null,null,null,null,"2019-11-21","19/20","18/19","17/18",null,"2019-11-21","N/A","N/A","N/A"]
[null,null,null,null,null,null,null,"2019-11-22","19/20","18/19","17/18",null,"2019-11-22","N/A","N/A","N/A"]
[null,null,null,null,null,null,null,"2019-11-23","19/20","18/19","17/18",null,"2019-11-23","N/A","N/A","N/A"]
[null,null,null,null,null,null,null,"2019-11-24","19/20","18/19","17/18",null,"2019-11-24","N/A","N/A","N/A"]
[null,null,null,null,null,null,null,"2019-11-25","19/20","18/19","17/18",null,"2019-11-25","N/A","N/A","N/A"]
[null,null,null,null,null,null,null,"2019-11-26","19/20","18/19","17/18",null,"2019-11-26","N/A","N/A","N/A"]
[null,null,null,null,null,null,null,"2019-11-27","19/20","18/19","17/18",null,"2019-11-27","N/A","N/A","N/A"]
[null,null,null,null,null,null,null,"2019-11-28","19/20","18/19","17/18",null,"2019-11-28","N/A","N/A","N/A"]
[null,null,null,null,null,null,null,"2019-11-29","19/20","18/19","17/18",null,"2019-11-29","N/A","N/A","N/A"]
[null,null,null,null,null,null,null,"2019-11-30","19/20","18/19","17/18",null,"2019-11-30","N/A","N/A","N/A"]
[null,null,null,null,null,null,null,"2019-12-01","19/20","18/19","17/18",null,"2019-12-01","N/A","N/A","N/A"]
[null,null,null,null,null,null,null,"2019-12-02","19/20","18/19","17/18",null,"2019-12-02","N/A","N/A","N/A"]
[null,null,null,null,null,null,null,"2019-12-03","19/20","18/19","17/18",null,"2019-12-03","N/A","N/A","N/A"]
[null,null,null,null,null,null,null,"2019-12-04","19/20","18/19","17/18",null,"2019-12-04","N/A","N/A","N/A"]
[null,null,null,null,null,null,null,"2019-12-05","19/20","18/19","17/18",null,"2019-12-05","N/A","N/A","N/A"]
[null,null,null,null,null,null,null,"2019-12-06","19/20","18/19","17/18",null,"2019-12-06","N/A","N/A","N/A"]
[null,null,null,null,null,null,null,"2019-12-07","19/20","18/19","17/18",null,"2019-12-07","N/A","N/A","N/A"]
[null,null,null,null,null,null,null,"2019-12-08","19/20","18/19","17/18",null,"2019-12-08","N/A","N/A","N/A"]
[null,null,null,null,null,null,null,"2019-12-09","19/20","18/19","17/18",null,"2019-12-09","N/A","N/A","N/A"]
[null,null,null,null,null,null,null,"2019-12-10","19/20","18/19","17/18",null,"2019-12-10","N/A","N/A","N/A"]
[null,null,null,null,null,null,null,"2019-12-11","19/20","18/19","17/18",null,"2019-12-11","N/A","N/A","N/A"]
[null,null,null,null,null,null,null,"2019-12-12","19/20","18/19","17/18",null,"2019-12-12","N/A","N/A","N/A"]
[null,null,null,null,null,null,null,"2019-12-13","19/20","18/19","17/18",null,"2019-12-13","N/A","N/A","N/A"]
[null,null,null,null,null,null,null,"2019-12-14","19/20","18/19","17/18",null,"2019-12-14","N/A","N/A","N/A"]
[null,null,null,null,null,null,null,"2019-12-15","19/20","18/19","17/18",null,"2019-12-15","N/A","N/A","N/A"]
[null,null,null,null,null,null,null,"2019-12-16","19/20","18/19","17/18",null,"2019-12-16","N/A","N/A","N/A"]
[null,null,null,null,null,null,null,"2019-12-17","19/20","18/19","17/18",null,"2019-12-17","N/A","N/A","N/A"]
[null,null,null,null,null,null,null,"2019-12-18","19/20","18/19","17/18",null,"2019-12-18","N/A","N/A","N/A"]
[null,null,null,null,null,null,null,"2019-12-19","19/20","18/19","17/18",null,"2019-12-19","N/A","N/A","N/A"]
[null,null,null,null,null,null,null,"2019-12-20","19/20","18/19","17/18",null,"2019-12-20","N/A","N/A","N/A"]
[null,null,null,null,null,null,null,"2019-12-21","19/20","18/19","17/18",null,"2019-12-21","N/A","N/A","N/A"]
[null,null,null,null,null,null,null,"2019-12-22","19/20","18/19","17/18",null,"2019-12-22","N/A","N/A","N/A"]
[null,null,null,null,null,null,null,"2019-12-23","19/20","18/19","17/18",null,"2019-12-23","N/A","N/A","N/A"]
[null,null,null,null,null,null,null,"2019-12-24","19/20","18/19","17/18",null,"2019-12-24","N/A","N/A","N/A"]
[null,null,null,null,null,null,null,"2019-12-25","19/20","18/19","17/18",null,"2019-12-25","N/A","N/A","N/A"]
[null,null,null,null,null,null,null,"2019-12-26","19/20","18/19","17/18",null,"2019-12-26","N/A","N/A","N/A"]
[null,null,null,null,null,null,null,"2019-12-27","19/20","18/19","17/18",null,"2019-12-27","N/A","N/A","N/A"]
[null,null,null,null,null,null,null,"2019-12-28","19/20","18/19","17/18",null,"2019-12-28","N/A","N/A","N/A"]
[null,null,null,null,null,null,null,"2019-12-29","19/20","18/19","17/18",null,"2019-12-29","N/A","N/A","N/A"]
[null,null,null,null,null,null,null,"2019-12-30","19/20","18/19","17/18",null,"2019-12-30","N/A","N/A","N/A"]
[null,null,null,null,null,null,null,"2019-12-31","19/20","18/19","17/18",null,"2019-12-31","N/A","N/A","N/A"]
[null,null,null,null,null,null,null,"2020-01-01","19/20","18/19","17/18",null,"2020-01-01","N/A","N/A","N/A"]
[null,null,null,null,null,null,null,"2020-01-02","19/20","18/19","17/18",null,"2020-01-02","N/A","N/A","N/A"]
[null,null,null,null,null,null,null,"2020-01-03","19/20","18/19","17/18",null,"2020-01-03","N/A","N/A","N/A"]
[null,null,null,null,null,null,null,"2020-01-04","19/20","18/19","17/18",null,"2020-01-04","N/A","N/A","N/A"]
[null,null,null,null,null,null,null,"2020-01-05","19/20","18/19","17/18",null,"2020-01-05","N/A","N/A","N/A"]
[null,null,null,null,null,null,null,"2020-01-06","19/20","18/19","17/18",null,"2020-01-06","N/A","N/A","N/A"]
[null,null,null,null,null,null,null,"2020-01-07","19/20","18/19","17/18",null,"2020-01-07","N/A","N/A","N/A"]
[null,null,null,null,null,null,null,"2020-01-08","19/20","18/19","17/18",null,"2020-01-08","N/A","N/A","N/A"]
[null,null,null,null,null,null,null,"2020-01-09","19/20","18/19","17/18",null,"2020-01-09","N/A","N/A","N/A"]
[null,null,null,null,null,null,null,"2020-01-10","19/20","18/19","17/18",null,"2020-01-10","N/A","N/A","N/A"]
[null,null,null,null,null,null,null,"2020-01-11","19/20","18/19","17/18",null,"2020-01-11","N/A","N/A","N/A"]
[null,null,null,null,null,null,null,"2020-01-12","19/20","18/19","17/18",null,"2020-01-12","N/A","N/A","N/A"]
[null,null,null,null,null,null,null,"2020-01-13","19/20","18/19","17/18",null,"2020-01-13","N/A","N/A","N/A"]
[null,null,null,null,null,null,null,"2020-01-14","19/20","18/19","17/18",null,"2020-01-14","N/A","N/A","N/A"]
[null,null,null,null,null,null,null,"2020-01-15","19/20","18/19","17/18",null,"2020-01-15","N/A","N/A","N/A"]
[null,null,null,null,null,null,null,"2020-01-16","19/20","18/19","17/18",null,"2020-01-16","N/A","N/A","N/A"]
[null,null,null,null,null,null,null,"2020-01-17","19/20","18/19","17/18",null,"2020-01-17","N/A","N/A","N/A"]
[null,null,null,null,null,null,null,"2020-01-18","19/20","18/19","17/18",null,"2020-01-18","N/A","N/A","N/A"]
[null,null,null,null,null,null,null,"2020-01-19","19/20","18/19","17/18",null,"2020-01-19","N/A","N/A","N/A"]
[null,null,null,null,null,null,null,"2020-01-20","19/20","18/19","17/18",null,"2020-01-20","N/A","N/A","N/A"]
[null,null,null,null,null,null,null,"2020-01-21","19/20","18/19","17/18",null,"2020-01-21","N/A","N/A","N/A"]
[null,null,null,null,null,null,null,"2020-01-22","19/20","18/19","17/18",null,"2020-01-22","N/A","N/A","N/A"]
[null,null,null,null,null,null,null,"2020-01-23","19/20","18/19","17/18",null,"2020-01-23","N/A","N/A","N/A"]
[null,null,null,null,null,null,null,"2020-01-24","19/20","18/19","17/18",null,"2020-01-24","N/A","N/A","N/A"]
[null,null,null,null,null,null,null,"2020-01-25","19/20","18/19","17/18",null,"2020-01-25","N/A","N/A","N/A"]
[null,null,null,null,null,null,null,"2020-01-26","19/20","18/19","17/18",null,"2020-01-26","N/A","N/A","N/A"]
[null,null,null,null,null,null,null,"2020-01-27","19/20","18/19","17/18",null,"2020-01-27","N/A","N/A","N/A"]
[null,null,null,null,null,null,null,"2020-01-28","19/20","18/19","17/18",null,"2020-01-28","N/A","N/A","N/A"]
[null,null,null,null,null,null,null,"2020-01-29","19/20","18/19","17/18",null,"2020-01-29","N/A","N/A","N/A"]
[null,null,null,null,null,null,null,"2020-01-30","19/20","18/19","17/18",null,"2020-01-30","N/A","N/A","N/A"]
[null,null,null,null,null,null,null,"2020-01-31","19/20","18/19","17/18",null,"2020-01-31","N/A","N/A","N/A"]
[null,null,null,null,null,null,null,"2020-02-01","19/20","18/19","17/18",null,"2020-02-01","N/A","N/A","N/A"]
[null,null,null,null,null,null,null,"2020-02-02","19/20","18/19","17/18",null,"2020-02-02","N/A","N/A","N/A"]
[null,null,null,null,null,null,null,"2020-02-03","19/20","18/19","17/18",null,"2020-02-03","N/A","N/A","N/A"]
[null,null,null,null,null,null,null,"2020-02-04","19/20","18/19","17/18",null,"2020-02-04","N/A","N/A","N/A"]
[null,null,null,null,null,null,null,"2020-02-05","19/20","18/19","17/18",null,"2020-02-05","N/A","N/A","N/A"]
[null,null,null,null,null,null,null,"2020-02-06","19/20","18/19","17/18",null,"2020-02-06","N/A","N/A","N/A"]
[null,null,null,null,null,null,null,"2020-02-07","19/20","18/19","17/18",null,"2020-02-07","N/A","N/A","N/A"]
[null,null,null,null,null,null,null,"2020-02-08","19/20","18/19","17/18",null,"2020-02-08","N/A","N/A","N/A"]
[null,null,null,null,null,null,null,"2020-02-09","19/20","18/19","17/18",null,"2020-02-09","N/A","N/A","N/A"]
[null,null,null,null,null,null,null,"2020-02-10","19/20","18/19","17/18",null,"2020-02-10","N/A","N/A","N/A"]
[null,null,null,null,null,null,null,"2020-02-11","19/20","18/19","17/18",null,"2020-02-11","N/A","N/A","N/A"]
[null,null,null,null,null,null,null,"2020-02-12","19/20","18/19","17/18",null,"2020-02-12","N/A","N/A","N/A"]
[null,null,null,null,null,null,null,"2020-02-13","19/20","18/19","17/18",null,"2020-02-13","N/A","N/A","N/A"]
[null,null,null,null,null,null,null,"2020-02-14","19/20","18/19","17/18",null,"2020-02-14","N/A","N/A","N/A"]
[null,null,null,null,null,null,null,"2020-02-15","19/20","18/19","17/18",null,"2020-02-15","N/A","N/A","N/A"]
[null,null,null,null,null,null,null,"2020-02-16","19/20","18/19","17/18",null,"2020-02-16","N/A","N/A","N/A"]
[null,null,null,null,null,null,null,"2020-02-17","19/20","18/19","17/18",null,"2020-02-17","N/A","N/A","N/A"]
[null,null,null,null,null,null,null,"2020-02-18","19/20","18/19","17/18",null,"2020-02-18","N/A","N/A","N/A"]
[null,null,null,null,null,null,null,"2020-02-19","19/20","18/19","17/18",null,"2020-02-19","N/A","N/A","N/A"]
[null,null,null,null,null,null,null,"2020-02-20","19/20","18/19","17/18",null,"2020-02-20","N/A","N/A","N/A"]
[null,null,null,null,null,null,null,"2020-02-21","19/20","18/19","17/18",null,"2020-02-21","N/A","N/A","N/A"]
[null,null,null,null,null,null,null,"2020-02-22","19/20","18/19","17/18",null,"2020-02-22","N/A","N/A","N/A"]
[null,null,null,null,null,null,null,"2020-02-23","19/20","18/19","17/18",null,"2020-02-23","N/A","N/A","N/A"]
[null,null,null,null,null,null,null,"2020-02-24","19/20","18/19","17/18",null,"2020-02-24","N/A","N/A","N/A"]
[null,null,null,null,null,null,null,"2020-02-25","19/20","18/19","17/18",null,"2020-02-25","N/A","N/A","N/A"]
[null,null,null,null,null,null,null,"2020-02-26","19/20","18/19","17/18",null,"2020-02-26","N/A","N/A","N/A"]
[null,null,null,null,null,null,null,"2020-02-27","19/20","18/19","17/18",null,"2020-02-27","N/A","N/A","N/A"]
[null,null,null,null,null,null,null,"2020-02-28","19/20","18/19","17/18",null,"2020-02-28","N/A","N/A","N/A"]
[null,null,null,null,null,null,null,"2020-02-29","19/20","18/19","17/18",null,"2020-02-29","N/A","N/A","N/A"]
[null,null,null,null,null,null,null,"2020-03-01","19/20","18/19","17/18",null,"2020-03-01","N/A","N/A","N/A"]
[null,null,null,null,null,null,null,"2020-03-02","19/20","18/19","17/18",null,"2020-03-02","N/A","N/A","N/A"]
[null,null,null,null,null,null,null,"2020-03-03","19/20","18/19","17/18",null,"2020-03-03","N/A","N/A","N/A"]
[null,null,null,null,null,null,null,"2020-03-04","19/20","18/19","17/18",null,"2020-03-04","N/A","N/A","N/A"]
[null,null,null,null,null,null,null,"2020-03-05","19/20","18/19","17/18",null,"2020-03-05","N/A","N/A","N/A"]
[null,null,null,null,null,null,null,"2020-03-06","19/20","18/19","17/18",null,"2020-03-06","N/A","N/A","N/A"]
[null,null,null,null,null,null,null,"2020-03-07","19/20","18/19","17/18",null,"2020-03-07","N/A","N/A","N/A"]
[null,null,null,null,null,null,null,"2020-03-08","19/20","18/19","17/18",null,"2020-03-08","N/A","N/A","N/A"]
[null,null,null,null,null,null,null,"2020-03-09","19/20","18/19","17/18",null,"2020-03-09","N/A","N/A","N/A"]
[null,null,null,null,null,null,null,"2020-03-10","19/20","18/19","17/18",null,"2020-03-10","N/A","N/A","N/A"]
[null,null,null,null,null,null,null,"2020-03-11","19/20","18/19","17/18",null,"2020-03-11","N/A","N/A","N/A"]
[null,null,null,null,null,null,null,"2020-03-12","19/20","18/19","17/18",null,"2020-03-12","N/A","N/A","N/A"]
[null,null,null,null,null,null,null,"2020-03-13","19/20","18/19","17/18",null,"2020-03-13","N/A","N/A","N/A"]
[null,null,null,null,null,null,null,"2020-03-14","19/20","18/19","17/18",null,"2020-03-14","N/A","N/A","N/A"]
[null,null,null,null,null,null,null,"2020-03-15","19/20","18/19","17/18",null,"2020-03-15","N/A","N/A","N/A"]
[null,null,null,null,null,null,null,"2020-03-16","19/20","18/19","17/18",null,"2020-03-16","N/A","N/A","N/A"]
[null,null,null,null,null,null,null,"2020-03-17","19/20","18/19","17/18",null,"2020-03-17","N/A","N/A","N/A"]
[null,null,null,null,null,null,null,"2020-03-18","19/20","18/19","17/18",null,"2020-03-18","N/A","N/A","N/A"]
[null,null,null,null,null,null,null,"2020-03-19","19/20","18/19","17/18",null,"2020-03-19","N/A","N/A","N/A"]
[null,null,null,null,null,null,null,"2020-03-20","19/20","18/19","17/18",null,"2020-03-20","N/A","N/A","N/A"]
[null,null,null,null,null,null,null,"2020-03-21","19/20","18/19","17/18",null,"2020-03-21","N/A","N/A","N/A"]
[null,null,null,null,null,null,null,"2020-03-22","19/20","18/19","17/18",null,"2020-03-22","N/A","N/A","N/A"]
[null,null,null,null,null,null,null,"2020-03-23","19/20","18/19","17/18",null,"2020-03-23","N/A","N/A","N/A"]
[null,null,null,null,null,null,null,"2020-03-24","19/20","18/19","17/18",null,"2020-03-24","N/A","N/A","N/A"]
[null,null,null,null,null,null,null,"2020-03-25","19/20","18/19","17/18",null,"2020-03-25","N/A","N/A","N/A"]
[null,null,null,null,null,null,null,"2020-03-26","19/20","18/19","17/18",null,"2020-03-26","N/A","N/A","N/A"]
[null,null,null,null,null,null,null,"2020-03-27","19/20","18/19","17/18",null,"2020-03-27","N/A","N/A","N/A"]
[null,null,null,null,null,null,null,"2020-03-28","19/20","18/19","17/18",null,"2020-03-28","N/A","N/A","N/A"]
[null,null,null,null,null,null,null,"2020-03-29","19/20","18/19","17/18",null,"2020-03-29","N/A","N/A","N/A"]
[null,null,null,null,null,null,null,"2020-03-30","19/20","18/19","17/18",null,"2020-03-30","N/A","N/A","N/A"]
[null,null,null,null,null,null,null,"2020-03-31","19/20","18/19","17/18",null,"2020-03-31","N/A","N/A","N/A"]
[null,null,null,null,null,null,null,"2020-04-01","19/20","18/19","17/18",null,"2020-04-01","N/A","N/A","N/A"]
[null,null,null,null,null,null,null,"2020-04-02","19/20","18/19","17/18",null,"2020-04-02","N/A","N/A","N/A"]
[null,null,null,null,null,null,null,"2020-04-03","19/20","18/19","17/18",null,"2020-04-03","N/A","N/A","N/A"]
[null,null,null,null,null,null,null,"2020-04-04","19/20","18/19","17/18",null,"2020-04-04","N/A","N/A","N/A"]
[null,null,null,null,null,null,null,"2020-04-05","19/20","18/19","17/18",null,"2020-04-05","N/A","N/A","N/A"]
[null,null,null,null,null,null,null,"2020-04-06","20/21","19/20","18/19",null,"2020-04-06","N/A","N/A","N/A"]
[null,null,null,null,null,null,null,"2020-04-07","20/21","19/20","18/19",null,"2020-04-07","N/A","N/A","N/A"]
[null,null,null,null,null,null,null,"2020-04-08","20/21","19/20","18/19",null,"2020-04-08","N/A","N/A","N/A"]
[null,null,null,null,null,null,null,"2020-04-09","20/21","19/20","18/19",null,"2020-04-09","N/A","N/A","N/A"]
[null,null,null,null,null,null,null,"2020-04-10","20/21","19/20","18/19",null,"2020-04-10","N/A","N/A","N/A"]
[null,null,null,null,null,null,null,"2020-04-11","20/21","19/20","18/19",null,"2020-04-11","N/A","N/A","N/A"]
[null,null,null,null,null,null,null,"2020-04-12","20/21","19/20","18/19",null,"2020-04-12","N/A","N/A","N/A"]
[null,null,null,null,null,null,null,"2020-04-13","20/21","19/20","18/19",null,"2020-04-13","N/A","N/A","N/A"]
[null,null,null,null,null,null,null,"2020-04-14","20/21","19/20","18/19",null,"2020-04-14","N/A","N/A","N/A"]
[null,null,null,null,null,null,null,"2020-04-15","20/21","19/20","18/19",null,"2020-04-15","N/A","N/A","N/A"]
[null,null,null,null,null,null,null,"2020-04-16","20/21","19/20","18/19",null,"2020-04-16","N/A","N/A","N/A"]
[null,null,null,null,null,null,null,"2020-04-17","20/21","19/20","18/19",null,"2020-04-17","N/A","N/A","N/A"]
[null,null,null,null,null,null,null,"2020-04-18","20/21","19/20","18/19",null,"2020-04-18","N/A","N/A","N/A"]
[null,null,null,null,null,null,null,"2020-04-19","20/21","19/20","18/19",null,"2020-04-19","N/A","N/A","N/A"]
[null,null,null,null,null,null,null,"2020-04-20","20/21","19/20","18/19",null,"2020-04-20","N/A","N/A","N/A"]
[null,null,null,null,null,null,null,"2020-04-21","20/21","19/20","18/19",null,"2020-04-21","N/A","N/A","N/A"]
[null,null,null,null,null,null,null,"2020-04-22","20/21","19/20","18/19",null,"2020-04-22","N/A","N/A","N/A"]
[null,null,null,null,null,null,null,"2020-04-23","20/21","19/20","18/19",null,"2020-04-23","N/A","N/A","N/A"]
[null,null,null,null,null,null,null,"2020-04-24","20/21","19/20","18/19",null,"2020-04-24","N/A","N/A","N/A"]
[null,null,null,null,null,null,null,"2020-04-25","20/21","19/20","18/19",null,"2020-04-25","N/A","N/A","N/A"]
[null,null,null,null,null,null,null,"2020-04-26","20/21","19/20","18/19",null,"2020-04-26","N/A","N/A","N/A"]
[null,null,null,null,null,null,null,"2020-04-27","20/21","19/20","18/19",null,"2020-04-27","N/A","N/A","N/A"]
[null,null,null,null,null,null,null,"2020-04-28","20/21","19/20","18/19",null,"2020-04-28","N/A","N/A","N/A"]
[null,null,null,null,null,null,null,"2020-04-29","20/21","19/20","18/19",null,"2020-04-29","N/A","N/A","N/A"]
[null,null,null,null,null,null,null,"2020-04-30","20/21","19/20","18/19",null,"2020-04-30","N/A","N/A","N/A"]
[null,null,null,null,null,null,null,"2020-05-01","20/21","19/20","18/19",null,"2020-05-01","N/A","N/A","N/A"]
[null,null,null,null,null,null,null,"2020-05-02","20/21","19/20","18/19",null,"2020-05-02","N/A","N/A","N/A"]
[null,null,null,null,null,null,null,"2020-05-03","20/21","19/20","18/19",null,"2020-05-03","N/A","N/A","N/A"]
[null,null,null,null,null,null,null,"2020-05-04","20/21","19/20","18/19",null,"2020-05-04","N/A","N/A","N/A"]
[null,null,null,null,null,null,null,"2020-05-05","20/21","19/20","18/19",null,"2020-05-05","N/A","N/A","N/A"]
[null,null,null,null,null,null,null,"2020-05-06","20/21","19/20","18/19",null,"2020-05-06","N/A","N/A","N/A"]
[null,null,null,null,null,null,null,"2020-05-07","20/21","19/20","18/19",null,"2020-05-07","N/A","N/A","N/A"]
[null,null,null,null,null,null,null,"2020-05-08","20/21","19/20","18/19",null,"2020-05-08","N/A","N/A","N/A"]
[null,null,null,null,null,null,null,"2020-05-09","20/21","19/20","18/19",null,"2020-05-09","N/A","N/A","N/A"]
[null,null,null,null,null,null,null,"2020-05-10","20/21","19/20","18/19",null,"2020-05-10","N/A","N/A","N/A"]
[null,null,null,null,null,null,null,"2020-05-11","20/21","19/20","18/19",null,"2020-05-11","N/A","N/A","N/A"]
[null,null,null,null,null,null,null,"2020-05-12","20/21","19/20","18/19",null,"2020-05-12","N/A","N/A","N/A"]
[null,null,null,null,null,null,null,"2020-05-13","20/21","19/20","18/19",null,"2020-05-13","N/A","N/A","N/A"]
[null,null,null,null,null,null,null,"2020-05-14","20/21","19/20","18/19",null,"2020-05-14","N/A","N/A","N/A"]
[null,null,null,null,null,null,null,"2020-05-15","20/21","19/20","18/19",null,"2020-05-15","N/A","N/A","N/A"]
[null,null,null,null,null,null,null,"2020-05-16","20/21","19/20","18/19",null,"2020-05-16","N/A","N/A","N/A"]
[null,null,null,null,null,null,null,"2020-05-17","20/21","19/20","18/19",null,"2020-05-17","N/A","N/A","N/A"]
[null,null,null,null,null,null,null,"2020-05-18","20/21","19/20","18/19",null,"2020-05-18","N/A","N/A","N/A"]
[null,null,null,null,null,null,null,"2020-05-19","20/21","19/20","18/19",null,"2020-05-19","N/A","N/A","N/A"]
[null,null,null,null,null,null,null,"2020-05-20","20/21","19/20","18/19",null,"2020-05-20","N/A","N/A","N/A"]
[null,null,null,null,null,null,null,"2020-05-21","20/21","19/20","18/19",null,"2020-05-21","N/A","N/A","N/A"]
[null,null,null,null,null,null,null,"2020-05-22","20/21","19/20","18/19",null,"2020-05-22","N/A","N/A","N/A"]
[null,null,null,null,null,null,null,"2020-05-23","20/21","19/20","18/19",null,"2020-05-23","N/A","N/A","N/A"]
[null,null,null,null,null,null,null,"2020-05-24","20/21","19/20","18/19",null,"2020-05-24","N/A","N/A","N/A"]
[null,null,null,null,null,null,null,"2020-05-25","20/21","19/20","18/19",null,"2020-05-25","N/A","N/A","N/A"]
[null,null,null,null,null,null,null,"2020-05-26","20/21","19/20","18/19",null,"2020-05-26","N/A","N/A","N/A"]
[null,null,null,null,null,null,null,"2020-05-27","20/21","19/20","18/19",null,"2020-05-27","N/A","N/A","N/A"]
[null,null,null,null,null,null,null,"2020-05-28","20/21","19/20","18/19",null,"2020-05-28","N/A","N/A","N/A"]
[null,null,null,null,null,null,null,"2020-05-29","20/21","19/20","18/19",null,"2020-05-29","N/A","N/A","N/A"]
[null,null,null,null,null,null,null,"2020-05-30","20/21","19/20","18/19",null,"2020-05-30","N/A","N/A","N/A"]
[null,null,null,null,null,null,null,"2020-05-31","20/21","19/20","18/19",null,"2020-05-31","N/A","N/A","N/A"]
[null,null,null,null,null,null,null,"2020-06-01","20/21","19/20","18/19",null,"2020-06-01","N/A","N/A","N/A"]
[null,null,null,null,null,null,null,"2020-06-02","20/21","19/20","18/19",null,"2020-06-02","N/A","N/A","N/A"]
[null,null,null,null,null,null,null,"2020-06-03","20/21","19/20","18/19",null,"2020-06-03","N/A","N/A","N/A"]
[null,null,null,null,null,null,null,"2020-06-04","20/21","19/20","18/19",null,"2020-06-04","N/A","N/A","N/A"]
[null,null,null,null,null,null,null,"2020-06-05","20/21","19/20","18/19",null,"2020-06-05","N/A","N/A","N/A"]
[null,null,null,null,null,null,null,"2020-06-06","20/21","19/20","18/19",null,"2020-06-06","N/A","N/A","N/A"]
[null,null,null,null,null,null,null,"2020-06-07","20/21","19/20","18/19",null,"2020-06-07","N/A","N/A","N/A"]
[null,null,null,null,null,null,null,"2020-06-08","20/21","19/20","18/19",null,"2020-06-08","N/A","N/A","N/A"]
[null,null,null,null,null,null,null,"2020-06-09","20/21","19/20","18/19",null,"2020-06-09","N/A","N/A","N/A"]
[null,null,null,null,null,null,null,"2020-06-10","20/21","19/20","18/19",null,"2020-06-10","N/A","N/A","N/A"]
[null,null,null,null,null,null,null,"2020-06-11","20/21","19/20","18/19",null,"2020-06-11","N/A","N/A","N/A"]
[null,null,null,null,null,null,null,"2020-06-12","20/21","19/20","18/19",null,"2020-06-12","N/A","N/A","N/A"]
[null,null,null,null,null,null,null,"2020-06-13","20/21","19/20","18/19",null,"2020-06-13","N/A","N/A","N/A"]
[null,null,null,null,null,null,null,"2020-06-14","20/21","19/20","18/19",null,"2020-06-14","N/A","N/A","N/A"]
[null,null,null,null,null,null,null,"2020-06-15","20/21","19/20","18/19",null,"2020-06-15","N/A","N/A","N/A"]
[null,null,null,null,null,null,null,"2020-06-16","20/21","19/20","18/19",null,"2020-06-16","N/A","N/A","N/A"]
[null,null,null,null,null,null,null,"2020-06-17","20/21","19/20","18/19",null,"2020-06-17","N/A","N/A","N/A"]
[null,null,null,null,null,null,null,"2020-06-18","20/21","19/20","18/19",null,"2020-06-18","N/A","N/A","N/A"]
[null,null,null,null,null,null,null,"2020-06-19","20/21","19/20","18/19",null,"2020-06-19","N/A","N/A","N/A"]
[null,null,null,null,null,null,null,"2020-06-20","20/21","19/20","18/19",null,"2020-06-20","N/A","N/A","N/A"]
[null,null,null,null,null,null,null,"2020-06-21","20/21","19/20","18/19",null,"2020-06-21","N/A","N/A","N/A"]
[null,null,null,null,null,null,null,"2020-06-22","20/21","19/20","18/19",null,"2020-06-22","N/A","N/A","N/A"]
[null,null,null,null,null,null,null,"2020-06-23","20/21","19/20","18/19",null,"2020-06-23","N/A","N/A","N/A"]
[null,null,null,null,null,null,null,"2020-06-24","20/21","19/20","18/19",null,"2020-06-24","N/A","N/A","N/A"]
[null,null,null,null,null,null,null,"2020-06-25","20/21","19/20","18/19",null,"2020-06-25","N/A","N/A","N/A"]
[null,null,null,null,null,null,null,"2020-06-26","20/21","19/20","18/19",null,"2020-06-26","N/A","N/A","N/A"]
[null,null,null,null,null,null,null,"2020-06-27","20/21","19/20","18/19",null,"2020-06-27","N/A","N/A","N/A"]
[null,null,null,null,null,null,null,"2020-06-28","20/21","19/20","18/19",null,"2020-06-28","N/A","N/A","N/A"]
[null,null,null,null,null,null,null,"2020-06-29","20/21","19/20","18/19",null,"2020-06-29","N/A","N/A","N/A"]
[null,null,null,null,null,null,null,"2020-06-30","20/21","19/20","18/19",null,"2020-06-30","N/A","N/A","N/A"]
[null,null,null,null,null,null,null,"2020-07-01","20/21","19/20","18/19",null,"2020-07-01","N/A","N/A","N/A"]
[null,null,null,null,null,null,null,"2020-07-02","20/21","19/20","18/19",null,"2020-07-02","N/A","N/A","N/A"]
[null,null,null,null,null,null,null,"2020-07-03","20/21","19/20","18/19",null,"2020-07-03","N/A","N/A","N/A"]
[null,null,null,null,null,null,null,"2020-07-04","20/21","19/20","18/19",null,"2020-07-04","N/A","N/A","N/A"]
[null,null,null,null,null,null,null,"2020-07-05","20/21","19/20","18/19",null,"2020-07-05","N/A","N/A","N/A"]
[null,null,null,null,null,null,null,"2020-07-06","20/21","19/20","18/19",null,"2020-07-06","N/A","N/A","N/A"]
[null,null,null,null,null,null,null,"2020-07-07","20/21","19/20","18/19",null,"2020-07-07","N/A","N/A","N/A"]
[null,null,null,null,null,null,null,"2020-07-08","20/21","19/20","18/19",null,"2020-07-08","N/A","N/A","N/A"]
[null,null,null,null,null,null,null,"2020-07-09","20/21","19/20","18/19",null,"2020-07-09","N/A","N/A","N/A"]
[null,null,null,null,null,null,null,"2020-07-10","20/21","19/20","18/19",null,"2020-07-10","N/A","N/A","N/A"]
[null,null,null,null,null,null,null,"2020-07-11","20/21","19/20","18/19",null,"2020-07-11","N/A","N/A","N/A"]
[null,null,null,null,null,null,null,"2020-07-12","20/21","19/20","18/19",null,"2020-07-12","N/A","N/A","N/A"]
[null,null,null,null,null,null,null,"2020-07-13","20/21","19/20","18/19",null,"2020-07-13","N/A","N/A","N/A"]
[null,null,null,null,null,null,null,"2020-07-14","20/21","19/20","18/19",null,"2020-07-14","N/A","N/A","N/A"]
[null,null,null,null,null,null,null,"2020-07-15","20/21","19/20","18/19",null,"2020-07-15","N/A","N/A","N/A"]
[null,null,null,null,null,null,null,"2020-07-16","20/21","19/20","18/19",null,"2020-07-16","N/A","N/A","N/A"]
[null,null,null,null,null,null,null,"2020-07-17","20/21","19/20","18/19",null,"2020-07-17","N/A","N/A","N/A"]
[null,null,null,null,null,null,null,"2020-07-18","20/21","19/20","18/19",null,"2020-07-18","N/A","N/A","N/A"]
[null,null,null,null,null,null,null,"2020-07-19","20/21","19/20","18/19",null,"2020-07-19","N/A","N/A","N/A"]
[null,null,null,null,null,null,null,"2020-07-20","20/21","19/20","18/19",null,"2020-07-20","N/A","N/A","N/A"]
[null,null,null,null,null,null,null,"2020-07-21","20/21","19/20","18/19",null,"2020-07-21","N/A","N/A","N/A"]
[null,null,null,null,null,null,null,"2020-07-22","20/21","19/20","18/19",null,"2020-07-22","N/A","N/A","N/A"]
[null,null,null,null,null,null,null,"2020-07-23","20/21","19/20","18/19",null,"2020-07-23","N/A","N/A","N/A"]
[null,null,null,null,null,null,null,"2020-07-24","20/21","19/20","18/19",null,"2020-07-24","N/A","N/A","N/A"]
[null,null,null,null,null,null,null,"2020-07-25","20/21","19/20","18/19",null,"2020-07-25","N/A","N/A","N/A"]
[null,null,null,null,null,null,null,"2020-07-26","20/21","19/20","18/19",null,"2020-07-26","N/A","N/A","N/A"]
[null,null,null,null,null,null,null,"2020-07-27","20/21","19/20","18/19",null,"2020-07-27","N/A","N/A","N/A"]
[null,null,null,null,null,null,null,"2020-07-28","20/21","19/20","18/19",null,"2020-07-28","N/A","N/A","N/A"]
[null,null,null,null,null,null,null,"2020-07-29","20/21","19/20","18/19",null,"2020-07-29","N/A","N/A","N/A"]
[null,null,null,null,null,null,null,"2020-07-30","20/21","19/20","18/19",null,"2020-07-30","N/A","N/A","N/A"]
[null,null,null,null,null,null,null,"2020-07-31","20/21","19/20","18/19",null,"2020-07-31","N/A","N/A","N/A"]
[null,null,null,null,null,null,null,"2020-08-01","20/21","19/20","18/19",null,"2020-08-01","N/A","N/A","N/A"]
[null,null,null,null,null,null,null,"2020-08-02","20/21","19/20","18/19",null,"2020-08-02","N/A","N/A","N/A"]
[null,null,null,null,null,null,null,"2020-08-03","20/21","19/20","18/19",null,"2020-08-03","N/A","N/A","N/A"]
[null,null,null,null,null,null,null,"2020-08-04","20/21","19/20","18/19",null,"2020-08-04","N/A","N/A","N/A"]
[null,null,null,null,null,null,null,"2020-08-05","20/21","19/20","18/19",null,"2020-08-05","N/A","N/A","N/A"]
[null,null,null,null,null,null,null,"2020-08-06","20/21","19/20","18/19",null,"2020-08-06","N/A","N/A","N/A"]
[null,null,null,null,null,null,null,"2020-08-07","20/21","19/20","18/19",null,"2020-08-07","N/A","N/A","N/A"]
[null,null,null,null,null,null,null,"2020-08-08","20/21","19/20","18/19",null,"2020-08-08","N/A","N/A","N/A"]
[null,null,null,null,null,null,null,"2020-08-09","20/21","19/20","18/19",null,"2020-08-09","N/A","N/A","N/A"]
[null,null,null,null,null,null,null,"2020-08-10","20/21","19/20","18/19",null,"2020-08-10","N/A","N/A","N/A"]
[null,null,null,null,null,null,null,"2020-08-11","20/21","19/20","18/19",null,"2020-08-11","N/A","N/A","N/A"]
[null,null,null,null,null,null,null,"2020-08-12","20/21","19/20","18/19",null,"2020-08-12","N/A","N/A","N/A"]
[null,null,null,null,null,null,null,"2020-08-13","20/21","19/20","18/19",null,"2020-08-13","N/A","N/A","N/A"]
[null,null,null,null,null,null,null,"2020-08-14","20/21","19/20","18/19",null,"2020-08-14","N/A","N/A","N/A"]
[null,null,null,null,null,null,null,"2020-08-15","20/21","19/20","18/19",null,"2020-08-15","N/A","N/A","N/A"]
[null,null,null,null,null,null,null,"2020-08-16","20/21","19/20","18/19",null,"2020-08-16","N/A","N/A","N/A"]
[null,null,null,null,null,null,null,"2020-08-17","20/21","19/20","18/19",null,"2020-08-17","N/A","N/A","N/A"]
[null,null,null,null,null,null,null,"2020-08-18","20/21","19/20","18/19",null,"2020-08-18","N/A","N/A","N/A"]
[null,null,null,null,null,null,null,"2020-08-19","20/21","19/20","18/19",null,"2020-08-19","N/A","N/A","N/A"]
[null,null,null,null,null,null,null,"2020-08-20","20/21","19/20","18/19",null,"2020-08-20","N/A","N/A","N/A"]
[null,null,null,null,null,null,null,"2020-08-21","20/21","19/20","18/19",null,"2020-08-21","N/A","N/A","N/A"]
[null,null,null,null,null,null,null,"2020-08-22","20/21","19/20","18/19",null,"2020-08-22","N/A","N/A","N/A"]
[null,null,null,null,null,null,null,"2020-08-23","20/21","19/20","18/19",null,"2020-08-23","N/A","N/A","N/A"]
[null,null,null,null,null,null,null,"2020-08-24","20/21","19/20","18/19",null,"2020-08-24","N/A","N/A","N/A"]
[null,null,null,null,null,null,null,"2020-08-25","20/21","19/20","18/19",null,"2020-08-25","N/A","N/A","N/A"]
[null,null,null,null,null,null,null,"2020-08-26","20/21","19/20","18/19",null,"2020-08-26","N/A","N/A","N/A"]
[null,null,null,null,null,null,null,"2020-08-27","20/21","19/20","18/19",null,"2020-08-27","N/A","N/A","N/A"]
[null,null,null,null,null,null,null,"2020-08-28","20/21","19/20","18/19",null,"2020-08-28","N/A","N/A","N/A"]
[null,null,null,null,null,null,null,"2020-08-29","20/21","19/20","18/19",null,"2020-08-29","N/A","N/A","N/A"]
[null,null,null,null,null,null,null,"2020-08-30","20/21","19/20","18/19",null,"2020-08-30","N/A","N/A","N/A"]
[null,null,null,null,null,null,null,"2020-08-31","20/21","19/20","18/19",null,"2020-08-31","N/A","N/A","N/A"]
[null,null,null,null,null,null,null,"2020-09-01","20/21","19/20","18/19",null,"2020-09-01","N/A","N/A","N/A"]
[null,null,null,null,null,null,null,"2020-09-02","20/21","19/20","18/19",null,"2020-09-02","N/A","N/A","N/A"]
[null,null,null,null,null,null,null,"2020-09-03","20/21","19/20","18/19",null,"2020-09-03","N/A","N/A","N/A"]
[null,null,null,null,null,null,null,"2020-09-04","20/21","19/20","18/19",null,"2020-09-04","N/A","N/A","N/A"]
[null,null,null,null,null,null,null,"2020-09-05","20/21","19/20","18/19",null,"2020-09-05","N/A","N/A","N/A"]
[null,null,null,null,null,null,null,"2020-09-06","20/21","19/20","18/19",null,"2020-09-06","N/A","N/A","N/A"]
[null,null,null,null,null,null,null,"2020-09-07","20/21","19/20","18/19",null,"2020-09-07","N/A","N/A","N/A"]
[null,null,null,null,null,null,null,"2020-09-08","20/21","19/20","18/19",null,"2020-09-08","N/A","N/A","N/A"]
[null,null,null,null,null,null,null,"2020-09-09","20/21","19/20","18/19",null,"2020-09-09","N/A","N/A","N/A"]
[null,null,null,null,null,null,null,"2020-09-10","20/21","19/20","18/19",null,"2020-09-10","N/A","N/A","N/A"]
[null,null,null,null,null,null,null,"2020-09-11","20/21","19/20","18/19",null,"2020-09-11","N/A","N/A","N/A"]
[null,null,null,null,null,null,null,"2020-09-12","20/21","19/20","18/19",null,"2020-09-12","N/A","N/A","N/A"]
[null,null,null,null,null,null,null,"2020-09-13","20/21","19/20","18/19",null,"2020-09-13","N/A","N/A","N/A"]
[null,null,null,null,null,null,null,"2020-09-14","20/21","19/20","18/19",null,"2020-09-14","N/A","N/A","N/A"]
[null,null,null,null,null,null,null,"2020-09-15","20/21","19/20","18/19",null,"2020-09-15","N/A","N/A","N/A"]
[null,null,null,null,null,null,null,"2020-09-16","20/21","19/20","18/19",null,"2020-09-16","N/A","N/A","N/A"]
[null,null,null,null,null,null,null,"2020-09-17","20/21","19/20","18/19",null,"2020-09-17","N/A","N/A","N/A"]
[null,null,null,null,null,null,null,"2020-09-18","20/21","19/20","18/19",null,"2020-09-18","N/A","N/A","N/A"]
[null,null,null,null,null,null,null,"2020-09-19","20/21","19/20","18/19",null,"2020-09-19","N/A","N/A","N/A"]
[null,null,null,null,null,null,null,"2020-09-20","20/21","19/20","18/19",null,"2020-09-20","N/A","N/A","N/A"]
[null,null,null,null,null,null,null,"2020-09-21","20/21","19/20","18/19",null,"2020-09-21","N/A","N/A","N/A"]
[null,null,null,null,null,null,null,"2020-09-22","20/21","19/20","18/19",null,"2020-09-22","N/A","N/A","N/A"]
[null,null,null,null,null,null,null,"2020-09-23","20/21","19/20","18/19",null,"2020-09-23","N/A","N/A","N/A"]
[null,null,null,null,null,null,null,"2020-09-24","20/21","19/20","18/19",null,"2020-09-24","N/A","N/A","N/A"]
[null,null,null,null,null,null,null,"2020-09-25","20/21","19/20","18/19",null,"2020-09-25","N/A","N/A","N/A"]
[null,null,null,null,null,null,null,"2020-09-26","20/21","19/20","18/19",null,"2020-09-26","N/A","N/A","N/A"]
[null,null,null,null,null,null,null,"2020-09-27","20/21","19/20","18/19",null,"2020-09-27","N/A","N/A","N/A"]
[null,null,null,null,null,null,null,"2020-09-28","20/21","19/20","18/19",null,"2020-09-28","N/A","N/A","N/A"]
[null,null,null,null,null,null,null,"2020-09-29","20/21","19/20","18/19",null,"2020-09-29","N/A","N/A","N/A"]
[null,null,null,null,null,null,null,"2020-09-30","20/21","19/20","18/19",null,"2020-09-30","N/A","N/A","N/A"]
[null,null,null,null,null,null,null,"2020-10-01","20/21","19/20","18/19",null,"2020-10-01","N/A","N/A","N/A"]
[null,null,null,null,null,null,null,"2020-10-02","20/21","19/20","18/19",null,"2020-10-02","N/A","N/A","N/A"]
[null,null,null,null,null,null,null,"2020-10-03","20/21","19/20","18/19",null,"2020-10-03","N/A","N/A","N/A"]
[null,null,null,null,null,null,null,"2020-10-04","20/21","19/20","18/19",null,"2020-10-04","N/A","N/A","N/A"]
[null,null,null,null,null,null,null,"2020-10-05","20/21","19/20","18/19",null,"2020-10-05","N/A","N/A","N/A"]
[null,null,null,null,null,null,null,"2020-10-06","20/21","19/20","18/19",null,"2020-10-06","N/A","N/A","N/A"]
[null,null,null,null,null,null,null,"2020-10-07","20/21","19/20","18/19",null,"2020-10-07","N/A","N/A","N/A"]
[null,null,null,null,null,null,null,"2020-10-08","20/21","19/20","18/19",null,"2020-10-08","N/A","N/A","N/A"]
[null,null,null,null,null,null,null,"2020-10-09","20/21","19/20","18/19",null,"2020-10-09","N/A","N/A","N/A"]
[null,null,null,null,null,null,null,"2020-10-10","20/21","19/20","18/19",null,"2020-10-10","N/A","N/A","N/A"]
[null,null,null,null,null,null,null,"2020-10-11","20/21","19/20","18/19",null,"2020-10-11","N/A","N/A","N/A"]
[null,null,null,null,null,null,null,"2020-10-12","20/21","19/20","18/19",null,"2020-10-12","N/A","N/A","N/A"]
[null,null,null,null,null,null,null,"2020-10-13","20/21","19/20","18/19",null,"2020-10-13","N/A","N/A","N/A"]
[null,null,null,null,null,null,null,"2020-10-14","20/21","19/20","18/19",null,"2020-10-14","N/A","N/A","N/A"]
[null,null,null,null,null,null,null,"2020-10-15","20/21","19/20","18/19",null,"2020-10-15","N/A","N/A","N/A"]
[null,null,null,null,null,null,null,"2020-10-16","20/21","19/20","18/19",null,"2020-10-16","N/A","N/A","N/A"]
[null,null,null,null,null,null,null,"2020-10-17","20/21","19/20","18/19",null,"2020-10-17","N/A","N/A","N/A"]
[null,null,null,null,null,null,null,"2020-10-18","20/21","19/20","18/19",null,"2020-10-18","N/A","N/A","N/A"]
[null,null,null,null,null,null,null,"2020-10-19","20/21","19/20","18/19",null,"2020-10-19","N/A","N/A","N/A"]
[null,null,null,null,null,null,null,"2020-10-20","20/21","19/20","18/19",null,"2020-10-20","N/A","N/A","N/A"]
[null,null,null,null,null,null,null,"2020-10-21","20/21","19/20","18/19",null,"2020-10-21","N/A","N/A","N/A"]
[null,null,null,null,null,null,null,"2020-10-22","20/21","19/20","18/19",null,"2020-10-22","N/A","N/A","N/A"]
[null,null,null,null,null,null,null,"2020-10-23","20/21","19/20","18/19",null,"2020-10-23","N/A","N/A","N/A"]
[null,null,null,null,null,null,null,"2020-10-24","20/21","19/20","18/19",null,"2020-10-24","N/A","N/A","N/A"]
[null,null,null,null,null,null,null,"2020-10-25","20/21","19/20","18/19",null,"2020-10-25","N/A","N/A","N/A"]
[null,null,null,null,null,null,null,"2020-10-26","20/21","19/20","18/19",null,"2020-10-26","N/A","N/A","N/A"]
[null,null,null,null,null,null,null,"2020-10-27","20/21","19/20","18/19",null,"2020-10-27","N/A","N/A","N/A"]
[null,null,null,null,null,null,null,"2020-10-28","20/21","19/20","18/19",null,"2020-10-28","N/A","N/A","N/A"]
[null,null,null,null,null,null,null,"2020-10-29","20/21","19/20","18/19",null,"2020-10-29","N/A","N/A","N/A"]
[null,null,null,null,null,null,null,"2020-10-30","20/21","19/20","18/19",null,"2020-10-30","N/A","N/A","N/A"]
[null,null,null,null,null,null,null,"2020-10-31","20/21","19/20","18/19",null,"2020-10-31","N/A","N/A","N/A"]
[null,null,null,null,null,null,null,"2020-11-01","20/21","19/20","18/19",null,"2020-11-01","N/A","N/A","N/A"]
[null,null,null,null,null,null,null,"2020-11-02","20/21","19/20","18/19",null,"2020-11-02","N/A","N/A","N/A"]
[null,null,null,null,null,null,null,"2020-11-03","20/21","19/20","18/19",null,"2020-11-03","N/A","N/A","N/A"]
[null,null,null,null,null,null,null,"2020-11-04","20/21","19/20","18/19",null,"2020-11-04","N/A","N/A","N/A"]
[null,null,null,null,null,null,null,"2020-11-05","20/21","19/20","18/19",null,"2020-11-05","N/A","N/A","N/A"]
[null,null,null,null,null,null,null,"2020-11-06","20/21","19/20","18/19",null,"2020-11-06","N/A","N/A","N/A"]
[null,null,null,null,null,null,null,"2020-11-07","20/21","19/20","18/19",null,"2020-11-07","N/A","N/A","N/A"]
[null,null,null,null,null,null,null,"2020-11-08","20/21","19/20","18/19",null,"2020-11-08","N/A","N/A","N/A"]
[null,null,null,null,null,null,null,"2020-11-09","20/21","19/20","18/19",null,"2020-11-09","N/A","N/A","N/A"]
[null,null,null,null,null,null,null,"2020-11-10","20/21","19/20","18/19",null,"2020-11-10","N/A","N/A","N/A"]
[null,null,null,null,null,null,null,"2020-11-11","20/21","19/20","18/19",null,"2020-11-11","N/A","N/A","N/A"]
[null,null,null,null,null,null,null,"2020-11-12","20/21","19/20","18/19",null,"2020-11-12","N/A","N/A","N/A"]
[null,null,null,null,null,null,null,"2020-11-13","20/21","19/20","18/19",null,"2020-11-13","N/A","N/A","N/A"]
[null,null,null,null,null,null,null,"2020-11-14","20/21","19/20","18/19",null,"2020-11-14","N/A","N/A","N/A"]
[null,null,null,null,null,null,null,"2020-11-15","20/21","19/20","18/19",null,"2020-11-15","N/A","N/A","N/A"]
[null,null,null,null,null,null,null,"2020-11-16","20/21","19/20","18/19",null,"2020-11-16","N/A","N/A","N/A"]
[null,null,null,null,null,null,null,"2020-11-17","20/21","19/20","18/19",null,"2020-11-17","N/A","N/A","N/A"]
[null,null,null,null,null,null,null,"2020-11-18","20/21","19/20","18/19",null,"2020-11-18","N/A","N/A","N/A"]
[null,null,null,null,null,null,null,"2020-11-19","20/21","19/20","18/19",null,"2020-11-19","N/A","N/A","N/A"]
[null,null,null,null,null,null,null,"2020-11-20","20/21","19/20","18/19",null,"2020-11-20","N/A","N/A","N/A"]
[null,null,null,null,null,null,null,"2020-11-21","20/21","19/20","18/19",null,"2020-11-21","N/A","N/A","N/A"]
[null,null,null,null,null,null,null,"2020-11-22","20/21","19/20","18/19",null,"2020-11-22","N/A","N/A","N/A"]
[null,null,null,null,null,null,null,"2020-11-23","20/21","19/20","18/19",null,"2020-11-23","N/A","N/A","N/A"]
[null,null,null,null,null,null,null,"2020-11-24","20/21","19/20","18/19",null,"2020-11-24","N/A","N/A","N/A"]
[null,null,null,null,null,null,null,"2020-11-25","20/21","19/20","18/19",null,"2020-11-25","N/A","N/A","N/A"]
[null,null,null,null,null,null,null,"2020-11-26","20/21","19/20","18/19",null,"2020-11-26","N/A","N/A","N/A"]
[null,null,null,null,null,null,null,"2020-11-27","20/21","19/20","18/19",null,"2020-11-27","N/A","N/A","N/A"]
[null,null,null,null,null,null,null,"2020-11-28","20/21","19/20","18/19",null,"2020-11-28","N/A","N/A","N/A"]
[null,null,null,null,null,null,null,"2020-11-29","20/21","19/20","18/19",null,"2020-11-29","N/A","N/A","N/A"]
[null,null,null,null,null,null,null,"2020-11-30","20/21","19/20","18/19",null,"2020-11-30","N/A","N/A","N/A"]
[null,null,null,null,null,null,null,"2020-12-01","20/21","19/20","18/19",null,"2020-12-01","N/A","N/A","N/A"]
[null,null,null,null,null,null,null,"2020-12-02","20/21","19/20","18/19",null,"2020-12-02","N/A","N/A","N/A"]
[null,null,null,null,null,null,null,"2020-12-03","20/21","19/20","18/19",null,"2020-12-03","N/A","N/A","N/A"]
[null,null,null,null,null,null,null,"2020-12-04","20/21","19/20","18/19",null,"2020-12-04","N/A","N/A","N/A"]
[null,null,null,null,null,null,null,"2020-12-05","20/21","19/20","18/19",null,"2020-12-05","N/A","N/A","N/A"]
[null,null,null,null,null,null,null,"2020-12-06","20/21","19/20","18/19",null,"2020-12-06","N/A","N/A","N/A"]
[null,null,null,null,null,null,null,"2020-12-07","20/21","19/20","18/19",null,"2020-12-07","N/A","N/A","N/A"]
[null,null,null,null,null,null,null,"2020-12-08","20/21","19/20","18/19",null,"2020-12-08","N/A","N/A","N/A"]
[null,null,null,null,null,null,null,"2020-12-09","20/21","19/20","18/19",null,"2020-12-09","N/A","N/A","N/A"]
[null,null,null,null,null,null,null,"2020-12-10","20/21","19/20","18/19",null,"2020-12-10","N/A","N/A","N/A"]
[null,null,null,null,null,null,null,"2020-12-11","20/21","19/20","18/19",null,"2020-12-11","N/A","N/A","N/A"]
[null,null,null,null,null,null,null,"2020-12-12","20/21","19/20","18/19",null,"2020-12-12","N/A","N/A","N/A"]
[null,null,null,null,null,null,null,"2020-12-13","20/21","19/20","18/19",null,"2020-12-13","N/A","N/A","N/A"]
[null,null,null,null,null,null,null,"2020-12-14","20/21","19/20","18/19",null,"2020-12-14","N/A","N/A","N/A"]
[null,null,null,null,null,null,null,"2020-12-15","20/21","19/20","18/19",null,"2020-12-15","N/A","N/A","N/A"]
[null,null,null,null,null,null,null,"2020-12-16","20/21","19/20","18/19",null,"2020-12-16","N/A","N/A","N/A"]
[null,null,null,null,null,null,null,"2020-12-17","20/21","19/20","18/19",null,"2020-12-17","N/A","N/A","N/A"]
[null,null,null,null,null,null,null,"2020-12-18","20/21","19/20","18/19",null,"2020-12-18","N/A","N/A","N/A"]
[null,null,null,null,null,null,null,"2020-12-19","20/21","19/20","18/19",null,"2020-12-19","N/A","N/A","N/A"]
[null,null,null,null,null,null,null,"2020-12-20","20/21","19/20","18/19",null,"2020-12-20","N/A","N/A","N/A"]
[null,null,null,null,null,null,null,"2020-12-21","20/21","19/20","18/19",null,"2020-12-21","N/A","N/A","N/A"]
[null,null,null,null,null,null,null,"2020-12-22","20/21","19/20","18/19",null,"2020-12-22","N/A","N/A","N/A"]
[null,null,null,null,null,null,null,"2020-12-23","20/21","19/20","18/19",null,"2020-12-23","N/A","N/A","N/A"]
[null,null,null,null,null,null,null,"2020-12-24","20/21","19/20","18/19",null,"2020-12-24","N/A","N/A","N/A"]
[null,null,null,null,null,null,null,"2020-12-25","20/21","19/20","18/19",null,"2020-12-25","N/A","N/A","N/A"]
[null,null,null,null,null,null,null,"2020-12-26","20/21","19/20","18/19",null,"2020-12-26","N/A","N/A","N/A"]
[null,null,null,null,null,null,null,"2020-12-27","20/21","19/20","18/19",null,"2020-12-27","N/A","N/A","N/A"]
[null,null,null,null,null,null,null,"2020-12-28","20/21","19/20","18/19",null,"2020-12-28","N/A","N/A","N/A"]
[null,null,null,null,null,null,null,"2020-12-29","20/21","19/20","18/19",null,"2020-12-29","N/A","N/A","N/A"]
[null,null,null,null,null,null,null,"2020-12-30","20/21","19/20","18/19",null,"2020-12-30","N/A","N/A","N/A"]
[null,null,null,null,null,null,null,"2020-12-31","20/21","19/20","18/19",null,"2020-12-31","N/A","N/A","N/A"]
[null,null,null,null,null,null,null,"2021-01-01","20/21","19/20","18/19",null,"2021-01-01","N/A","N/A","N/A"]
[null,null,null,null,null,null,null,"2021-01-02","20/21","19/20","18/19",null,"2021-01-02","N/A","N/A","N/A"]
[null,null,null,null,null,null,null,"2021-01-03","20/21","19/20","18/19",null,"2021-01-03","N/A","N/A","N/A"]
[null,null,null,null,null,null,null,"2021-01-04","20/21","19/20","18/19",null,"2021-01-04","N/A","N/A","N/A"]
[null,null,null,null,null,null,null,"2021-01-05","20/21","19/20","18/19",null,"2021-01-05","N/A","N/A","N/A"]
[null,null,null,null,null,null,null,"2021-01-06","20/21","19/20","18/19",null,"2021-01-06","N/A","N/A","N/A"]
[null,null,null,null,null,null,null,"2021-01-07","20/21","19/20","18/19",null,"2021-01-07","N/A","N/A","N/A"]
[null,null,null,null,null,null,null,"2021-01-08","20/21","19/20","18/19",null,"2021-01-08","N/A","N/A","N/A"]
[null,null,null,null,null,null,null,"2021-01-09","20/21","19/20","18/19",null,"2021-01-09","N/A","N/A","N/A"]
[null,null,null,null,null,null,null,"2021-01-10","20/21","19/20","18/19",null,"2021-01-10","N/A","N/A","N/A"]
[null,null,null,null,null,null,null,"2021-01-11","20/21","19/20","18/19",null,"2021-01-11","N/A","N/A","N/A"]
[null,null,null,null,null,null,null,"2021-01-12","20/21","19/20","18/19",null,"2021-01-12","N/A","N/A","N/A"]
[null,null,null,null,null,null,null,"2021-01-13","20/21","19/20","18/19",null,"2021-01-13","N/A","N/A","N/A"]
[null,null,null,null,null,null,null,"2021-01-14","20/21","19/20","18/19",null,"2021-01-14","N/A","N/A","N/A"]
[null,null,null,null,null,null,null,"2021-01-15","20/21","19/20","18/19",null,"2021-01-15","N/A","N/A","N/A"]
[null,null,null,null,null,null,null,"2021-01-16","20/21","19/20","18/19",null,"2021-01-16","N/A","N/A","N/A"]
[null,null,null,null,null,null,null,"2021-01-17","20/21","19/20","18/19",null,"2021-01-17","N/A","N/A","N/A"]
[null,null,null,null,null,null,null,"2021-01-18","20/21","19/20","18/19",null,"2021-01-18","N/A","N/A","N/A"]
[null,null,null,null,null,null,null,"2021-01-19","20/21","19/20","18/19",null,"2021-01-19","N/A","N/A","N/A"]
[null,null,null,null,null,null,null,"2021-01-20","20/21","19/20","18/19",null,"2021-01-20","N/A","N/A","N/A"]
[null,null,null,null,null,null,null,"2021-01-21","20/21","19/20","18/19",null,"2021-01-21","N/A","N/A","N/A"]
[null,null,null,null,null,null,null,"2021-01-22","20/21","19/20","18/19",null,"2021-01-22","N/A","N/A","N/A"]
[null,null,null,null,null,null,null,"2021-01-23","20/21","19/20","18/19",null,"2021-01-23","N/A","N/A","N/A"]
[null,null,null,null,null,null,null,"2021-01-24","20/21","19/20","18/19",null,"2021-01-24","N/A","N/A","N/A"]
[null,null,null,null,null,null,null,"2021-01-25","20/21","19/20","18/19",null,"2021-01-25","N/A","N/A","N/A"]
[null,null,null,null,null,null,null,"2021-01-26","20/21","19/20","18/19",null,"2021-01-26","N/A","N/A","N/A"]
[null,null,null,null,null,null,null,"2021-01-27","20/21","19/20","18/19",null,"2021-01-27","N/A","N/A","N/A"]
[null,null,null,null,null,null,null,"2021-01-28","20/21","19/20","18/19",null,"2021-01-28","N/A","N/A","N/A"]
[null,null,null,null,null,null,null,"2021-01-29","20/21","19/20","18/19",null,"2021-01-29","N/A","N/A","N/A"]
[null,null,null,null,null,null,null,"2021-01-30","20/21","19/20","18/19",null,"2021-01-30","N/A","N/A","N/A"]
[null,null,null,null,null,null,null,"2021-01-31","20/21","19/20","18/19",null,"2021-01-31","N/A","N/A","N/A"]
[null,null,null,null,null,null,null,"2021-02-01","20/21","19/20","18/19",null,"2021-02-01","N/A","N/A","N/A"]
[null,null,null,null,null,null,null,"2021-02-02","20/21","19/20","18/19",null,"2021-02-02","N/A","N/A","N/A"]
[null,null,null,null,null,null,null,"2021-02-03","20/21","19/20","18/19",null,"2021-02-03","N/A","N/A","N/A"]
[null,null,null,null,null,null,null,"2021-02-04","20/21","19/20","18/19",null,"2021-02-04","N/A","N/A","N/A"]
[null,null,null,null,null,null,null,"2021-02-05","20/21","19/20","18/19",null,"2021-02-05","N/A","N/A","N/A"]
[null,null,null,null,null,null,null,"2021-02-06","20/21","19/20","18/19",null,"2021-02-06","N/A","N/A","N/A"]
[null,null,null,null,null,null,null,"2021-02-07","20/21","19/20","18/19",null,"2021-02-07","N/A","N/A","N/A"]
[null,null,null,null,null,null,null,"2021-02-08","20/21","19/20","18/19",null,"2021-02-08","N/A","N/A","N/A"]
[null,null,null,null,null,null,null,"2021-02-09","20/21","19/20","18/19",null,"2021-02-09","N/A","N/A","N/A"]
[null,null,null,null,null,null,null,"2021-02-10","20/21","19/20","18/19",null,"2021-02-10","N/A","N/A","N/A"]
[null,null,null,null,null,null,null,"2021-02-11","20/21","19/20","18/19",null,"2021-02-11","N/A","N/A","N/A"]
[null,null,null,null,null,null,null,"2021-02-12","20/21","19/20","18/19",null,"2021-02-12","N/A","N/A","N/A"]
[null,null,null,null,null,null,null,"2021-02-13","20/21","19/20","18/19",null,"2021-02-13","N/A","N/A","N/A"]
[null,null,null,null,null,null,null,"2021-02-14","20/21","19/20","18/19",null,"2021-02-14","N/A","N/A","N/A"]
[null,null,null,null,null,null,null,"2021-02-15","20/21","19/20","18/19",null,"2021-02-15","N/A","N/A","N/A"]
[null,null,null,null,null,null,null,"2021-02-16","20/21","19/20","18/19",null,"2021-02-16","N/A","N/A","N/A"]
[null,null,null,null,null,null,null,"2021-02-17","20/21","19/20","18/19",null,"2021-02-17","N/A","N/A","N/A"]
[null,null,null,null,null,null,null,"2021-02-18","20/21","19/20","18/19",null,"2021-02-18","N/A","N/A","N/A"]
[null,null,null,null,null,null,null,"2021-02-19","20/21","19/20","18/19",null,"2021-02-19","N/A","N/A","N/A"]
[null,null,null,null,null,null,null,"2021-02-20","20/21","19/20","18/19",null,"2021-02-20","N/A","N/A","N/A"]
[null,null,null,null,null,null,null,"2021-02-21","20/21","19/20","18/19",null,"2021-02-21","N/A","N/A","N/A"]
[null,null,null,null,null,null,null,"2021-02-22","20/21","19/20","18/19",null,"2021-02-22","N/A","N/A","N/A"]
[null,null,null,null,null,null,null,"2021-02-23","20/21","19/20","18/19",null,"2021-02-23","N/A","N/A","N/A"]
[null,null,null,null,null,null,null,"2021-02-24","20/21","19/20","18/19",null,"2021-02-24","N/A","N/A","N/A"]
[null,null,null,null,null,null,null,"2021-02-25","20/21","19/20","18/19",null,"2021-02-25","N/A","N/A","N/A"]
[null,null,null,null,null,null,null,"2021-02-26","20/21","19/20","18/19",null,"2021-02-26","N/A","N/A","N/A"]
[null,null,null,null,null,null,null,"2021-02-27","20/21","19/20","18/19",null,"2021-02-27","N/A","N/A","N/A"]
[null,null,null,null,null,null,null,"2021-02-28","20/21","19/20","18/19",null,"2021-02-28","N/A","N/A","N/A"]
[null,null,null,null,null,null,null,"2021-03-01","20/21","19/20","18/19",null,"2021-03-01","N/A","N/A","N/A"]
[null,null,null,null,null,null,null,"2021-03-02","20/21","19/20","18/19",null,"2021-03-02","N/A","N/A","N/A"]
[null,null,null,null,null,null,null,"2021-03-03","20/21","19/20","18/19",null,"2021-03-03","N/A","N/A","N/A"]
[null,null,null,null,null,null,null,"2021-03-04","20/21","19/20","18/19",null,"2021-03-04","N/A","N/A","N/A"]
[null,null,null,null,null,null,null,"2021-03-05","20/21","19/20","18/19",null,"2021-03-05","N/A","N/A","N/A"]
[null,null,null,null,null,null,null,"2021-03-06","20/21","19/20","18/19",null,"2021-03-06","N/A","N/A","N/A"]
[null,null,null,null,null,null,null,"2021-03-07","20/21","19/20","18/19",null,"2021-03-07","N/A","N/A","N/A"]
[null,null,null,null,null,null,null,"2021-03-08","20/21","19/20","18/19",null,"2021-03-08","N/A","N/A","N/A"]
[null,null,null,null,null,null,null,"2021-03-09","20/21","19/20","18/19",null,"2021-03-09","N/A","N/A","N/A"]
[null,null,null,null,null,null,null,"2021-03-10","20/21","19/20","18/19",null,"2021-03-10","N/A","N/A","N/A"]
[null,null,null,null,null,null,null,"2021-03-11","20/21","19/20","18/19",null,"2021-03-11","N/A","N/A","N/A"]
[null,null,null,null,null,null,null,"2021-03-12","20/21","19/20","18/19",null,"2021-03-12","N/A","N/A","N/A"]
[null,null,null,null,null,null,null,"2021-03-13","20/21","19/20","18/19",null,"2021-03-13","N/A","N/A","N/A"]
[null,null,null,null,null,null,null,"2021-03-14","20/21","19/20","18/19",null,"2021-03-14","N/A","N/A","N/A"]
[null,null,null,null,null,null,null,"2021-03-15","20/21","19/20","18/19",null,"2021-03-15","N/A","N/A","N/A"]
[null,null,null,null,null,null,null,"2021-03-16","20/21","19/20","18/19",null,"2021-03-16","N/A","N/A","N/A"]
[null,null,null,null,null,null,null,"2021-03-17","20/21","19/20","18/19",null,"2021-03-17","N/A","N/A","N/A"]
[null,null,null,null,null,null,null,"2021-03-18","20/21","19/20","18/19",null,"2021-03-18","N/A","N/A","N/A"]
[null,null,null,null,null,null,null,"2021-03-19","20/21","19/20","18/19",null,"2021-03-19","N/A","N/A","N/A"]
[null,null,null,null,null,null,null,"2021-03-20","20/21","19/20","18/19",null,"2021-03-20","N/A","N/A","N/A"]
[null,null,null,null,null,null,null,"2021-03-21","20/21","19/20","18/19",null,"2021-03-21","N/A","N/A","N/A"]
[null,null,null,null,null,null,null,"2021-03-22","20/21","19/20","18/19",null,"2021-03-22","N/A","N/A","N/A"]
[null,null,null,null,null,null,null,"2021-03-23","20/21","19/20","18/19",null,"2021-03-23","N/A","N/A","N/A"]
[null,null,null,null,null,null,null,"2021-03-24","20/21","19/20","18/19",null,"2021-03-24","N/A","N/A","N/A"]
[null,null,null,null,null,null,null,"2021-03-25","20/21","19/20","18/19",null,"2021-03-25","N/A","N/A","N/A"]
[null,null,null,null,null,null,null,"2021-03-26","20/21","19/20","18/19",null,"2021-03-26","N/A","N/A","N/A"]
[null,null,null,null,null,null,null,"2021-03-27","20/21","19/20","18/19",null,"2021-03-27","N/A","N/A","N/A"]
[null,null,null,null,null,null,null,"2021-03-28","20/21","19/20","18/19",null,"2021-03-28","N/A","N/A","N/A"]
[null,null,null,null,null,null,null,"2021-03-29","20/21","19/20","18/19",null,"2021-03-29","N/A","N/A","N/A"]
[null,null,null,null,null,null,null,"2021-03-30","20/21","19/20","18/19",null,"2021-03-30","N/A","N/A","N/A"]
[null,null,null,null,null,null,null,"2021-03-31","20/21","19/20","18/19",null,"2021-03-31","N/A","N/A","N/A"]
[null,null,null,null,null,null,null,"2021-04-01","20/21","19/20","18/19",null,"2021-04-01","N/A","N/A","N/A"]
[null,null,null,null,null,null,null,"2021-04-02","20/21","19/20","18/19",null,"2021-04-02","N/A","N/A","N/A"]
[null,null,null,null,null,null,null,"2021-04-03","20/21","19/20","18/19",null,"2021-04-03","N/A","N/A","N/A"]
[null,null,null,null,null,null,null,"2021-04-04","20/21","19/20","18/19",null,"2021-04-04","N/A","N/A","N/A"]
[null,null,null,null,null,null,null,"2021-04-05","20/21","19/20","18/19",null,"2021-04-05","N/A","N/A","N/A"]
[null,null,null,null,null,null,null,"2021-04-06","20/21","19/20","18/19",null,"2021-04-06","N/A","N/A","N/A"]